{"text_format":"1","workbook":"xlsx","n_sheets":29,"sheets":["Cover","Credits-Deficits -->","Cred-Def Summary","Credits Generated","Fuel Energy Consumption","CI Targets and Inputs ","Availability + Consumption -->","Summary Table ","Gasoline + Alts Forecast","Petroleum Availability","Ethanol Availability","Diesel + Alts Cons Forecast","Biodiesel Availability","Renewable Diesel Availability","Electricity Cons Forecast","Electricity Availability","Natural Gas + RNG Forecast","Natural Gas Availability","Renew Natural Gas Availability","Propane Consumption Forecast","Propane Availability","Data Sources-->","Gas & Diesel Forecast Data","Vehicle Stock Forecast","CNG Vehicle Registrations","Washington EV Data","Propane EIA Data","Sheet1","Conversions"],"not_rendered":{"charts":0,"images":2,"macros":0,"external_links":0,"defined_names":27,"comments":2,"pivot_tables":0},"unopened":[],"bounds":{"document_bytes":16777216,"sheet_cells":100000,"rows_first":2000,"rows_last":500,"rows_between":2000,"halvings":0,"cell_chars":16384,"cell_head_chars":4096},"cells_cut":0,"cells_raw":0,"read":"whole","date_system":"1900"}

{"sheet":"Cover","index":0,"n_rows":9,"n_cols":4,"rows_kept":9,"cut":false,"hidden":false,"merged":[]}
[]
[]
[]
[]
[]
[]
[null,null,null,"Draft Clean Fuel Supply Forecast"]
[null,null,null,"BRG Work Product for the Washington State Department of Commerce"]
{"$rows_left_out":2}
{"sheet":"Credits-Deficits -->","index":1,"n_rows":0,"n_cols":0,"rows_kept":0,"cut":false,"hidden":false,"merged":[]}

{"sheet":"Cred-Def Summary","index":2,"n_rows":6,"n_cols":8,"rows_kept":6,"cut":false,"hidden":false,"merged":[]}
[]
[null,"Credits/Deficits/Bank Balance Summary Table"]
[]
[null,"Year","Fueling Related Credit Generation","Fueling Related Deficit Generation","Non-Fueling Capacity and Infrastructure Credits","Net Credit Generation","Bank Beginning Balance","Bank Ending Balance"]
[null,2023,{"$f":"SUMIF('Credits Generated'!$C6:$K6,\">0\")","v":1017225.3787015554},{"$f":"SUMIF('Credits Generated'!$C6:$K6,\"<0\")","v":-754573.79610776238},{"$f":"-D5*(1/20)","v":37728.689805388123},{"$f":"SUM(C5:E5)","v":300380.27239918115},0,{"$f":"G5+F5","v":300380.27239918115}]
[null,2024,{"$f":"SUMIF('Credits Generated'!$C7:$K7,\">0\")","v":1157563.6207770281},{"$f":"SUMIF('Credits Generated'!$C7:$K7,\"<0\")","v":-961036.46369768225},{"$f":"-D6*(1/20)","v":48051.823184884117},{"$f":"SUM(C6:E6)","v":244578.98026423002},{"$f":"H5","v":300380.27239918115},{"$f":"G6+F6","v":544959.2526634112}]

{"sheet":"Credits Generated","index":3,"n_rows":12,"n_cols":12,"rows_kept":12,"cut":false,"hidden":false,"merged":[]}
[]
[null,"Credits Generation"]
[]
[null,"Credits Generated by Fuel Type"]
[null,"Year","Gasoline","Ethanol","Electricity","Diesel","Biodiesel","Renewable Diesel","Natural Gas","RNG","Propane","Total"]
[null,2023,{"$f":"(C11*'Fuel Energy Consumption'!C5)/(10^6)","v":-604112.26525800163},{"$f":"(D11*'Fuel Energy Consumption'!D5)/(10^6)","v":544750.40537774994},{"$f":"(E11*'Fuel Energy Consumption'!G5)/(10^6)","v":61011.088150684547},{"$f":"(F11*'Fuel Energy Consumption'!H5)/(10^6)","v":-150461.53084976072},{"$f":"(G11*'Fuel Energy Consumption'!I5)/(10^6)","v":223161.41749247999},{"$f":"(H11*'Fuel Energy Consumption'!J5)/(10^6)","v":184168.21395},{"$f":"(I11*'Fuel Energy Consumption'!K5)/(10^6)","v":59.293918359581127},{"$f":"(J11*'Fuel Energy Consumption'!L5)/(10^6)","v":359.53381228138255},{"$f":"(K11*'Fuel Energy Consumption'!M5)/(10^6)","v":3715.4259999999945},{"$f":"SUM(C6:K6)","v":262651.58259379311}]
[null,2024,{"$f":"(C12*'Fuel Energy Consumption'!C6)/(10^6)","v":-766319.33608400158},{"$f":"(D12*'Fuel Energy Consumption'!D6)/(10^6)","v":542390.31796949985},{"$f":"(E12*'Fuel Energy Consumption'!G6)/(10^6)","v":76059.958133169464},{"$f":"(F12*'Fuel Energy Consumption'!H6)/(10^6)","v":-194717.1276136807},{"$f":"(G12*'Fuel Energy Consumption'!I6)/(10^6)","v":264585.24108989001},{"$f":"(H12*'Fuel Energy Consumption'!J6)/(10^6)","v":270401.89060500002},{"$f":"(I12*'Fuel Energy Consumption'!K6)/(10^6)","v":34.256091732991372},{"$f":"(J12*'Fuel Energy Consumption'!L6)/(10^6)","v":393.19610995805249},{"$f":"(K12*'Fuel Energy Consumption'!M6)/(10^6)","v":3698.7607777777716},{"$f":"SUM(C7:K7)","v":196527.1570793459}]
[]
{"$rows_left_out":5}
{"sheet":"Fuel Energy Consumption","index":4,"n_rows":21,"n_cols":13,"rows_kept":21,"cut":false,"hidden":false,"merged":[]}
[]
[null,"Energy Consumption per Fuel (MJ)"]
[]
[null,"Year","Gasoline","Ethanol","Electricity (BEV)","Electricity (PHEV)","Total Electricity","Diesel","Biodiesel","Renewable Diesel","Natural Gas","Renewable Natural Gas (Landfill)","Propane"]
[null,2023,{"$f":"(('Summary Table '!H$5*(10^6))*E10)","v":300553365800},{"$f":"(('Summary Table '!H6*(10^6))*$E$11)","v":21608504775.000004},{"$f":"('Summary Table '!H15*(10^6)*E18)","v":666819718.84799993},{"$f":"('Summary Table '!H16*(10^6)*E18)","v":98876035.938860282},{"$f":"SUM(Table812[[#This Row],[Electricity (BEV)]:[Electricity (PHEV)]])","v":765695754.78686023},{"$f":"('Summary Table '!H9*(10^6))*$E$12","v":95835369968},{"$f":"(('Summary Table '!H$10*(10^6))*E13)","v":5050043392},{"$f":"(('Summary Table '!H12*(10^6))*'Fuel Energy Consumption'!$E$14)","v":3801986250},{"$f":"('Summary Table '!H18*(10^6))*'Fuel Energy Consumption'!$E$12","v":2752735.2998877042},{"$f":"('Summary Table '!H19*(10^6))*'Fuel Energy Consumption'!$E$12","v":10272394.636610931},{"$f":"('Summary Table '!H22*(10^6)*'Fuel Energy Consumption'!$E$17)","v":226826984.12698385}]
[null,2024,{"$f":"(('Summary Table '!I$5*(10^6))*$E$10)","v":305306508400},{"$f":"(('Summary Table '!I6*(10^6))*$E$11)","v":21950235450},{"$f":"('Summary Table '!I15*(10^6)*E18)","v":848430980.78400004},{"$f":"('Summary Table '!I16*(10^6)*E18)","v":112157464.29231907},{"$f":"SUM(Table812[[#This Row],[Electricity (BEV)]:[Electricity (PHEV)]])","v":960588445.0763191},{"$f":"('Summary Table '!I9*(10^6))*$E$12","v":94066245224},{"$f":"(('Summary Table '!I$10*(10^6)*E13))","v":6055967981},{"$f":"(('Summary Table '!I12*(10^6))*'Fuel Energy Consumption'!$E$14)","v":5640423250},{"$f":"('Summary Table '!I18*(10^6))*'Fuel Energy Consumption'!$E$12","v":1628141.2420623284},{"$f":"('Summary Table '!I19*(10^6))*'Fuel Energy Consumption'!$E$12","v":11396988.694436304},{"$f":"('Summary Table '!I22*(10^6)*'Fuel Energy Consumption'!$E$17)","v":232919444.44444412}]
[]
[null,null,"Energy Densities"]
{"$rows_left_out":14}
{"sheet":"CI Targets and Inputs ","index":5,"n_rows":26,"n_cols":4,"rows_kept":26,"cut":false,"hidden":false,"merged":[]}
[]
[null,"CI Targets, Factor Inputs, and Conversions"]
[]
[null,"CI Targets"]
[null,"Year","Gasoline","Diesel"]
[null,null,"[1]","[2]"]
[null,2023,98.36,99.52]
[null,2024,97.86,99.02]
{"$rows_left_out":19}
{"sheet":"Availability + Consumption -->","index":6,"n_rows":0,"n_cols":0,"rows_kept":0,"cut":false,"hidden":false,"merged":[]}

{"sheet":"Summary Table ","index":7,"n_rows":40,"n_cols":10,"rows_kept":40,"cut":false,"hidden":false,"merged":[]}
[]
[null,null,"Summary Table of Fuel Consumption Forecasts"]
[]
[null,null,"Fuel Type","Unit","Citation Reference","2021","2022","2023","2024","CAGR % vs 2021"]
[null,null,"Fossil Gasoline","MM Gallons","[1]",{"$f":"'Gas & Diesel Forecast Data'!K$6-F$6","v":2250.835},{"$f":"'Gas & Diesel Forecast Data'!L$6-G$6","v":2399.7474999999999},{"$f":"'Gas & Diesel Forecast Data'!M$6-H$6","v":2453.8975},{"$f":"'Gas & Diesel Forecast Data'!N$6-I$6","v":2492.7049999999999},{"$f":"((Table2[[#This Row],[2024]]/Table2[[#This Row],[2021]])^(1/(Table2[[#Headers],[2024]]-Table2[[#Headers],[2021]])))-1","v":3.4607784348449799E-2}]
[null,null,"Ethanol","MM Gallons","[2]",{"$f":"'Gas & Diesel Forecast Data'!K$6*'Summary Table '!F$7","v":243.16500000000002},{"$f":"'Gas & Diesel Forecast Data'!L$6*'Summary Table '!G$7","v":259.2525},{"$f":"'Gas & Diesel Forecast Data'!M$6*'Summary Table '!H$7","v":265.10250000000002},{"$f":"'Gas & Diesel Forecast Data'!N$6*'Summary Table '!I$7","v":269.29500000000002},{"$f":"((Table2[[#This Row],[2024]]/Table2[[#This Row],[2021]])^(1/(Table2[[#Headers],[2024]]-Table2[[#Headers],[2021]])))-1","v":3.4607784348449799E-2}]
[null,null,"Ethanol Blend Rate","%","[3]",9.7500000000000003E-2,9.7500000000000003E-2,9.7500000000000003E-2,9.7500000000000003E-2]
[null,null,"Total Gasoline","MM Gallons","[4]",{"$f":"SUM(F5:F6)","v":2494},{"$f":"SUM(G5:G6)","v":2659},{"$f":"SUM(H5:H6)","v":2719},2762,{"$f":"((Table2[[#This Row],[2024]]/Table2[[#This Row],[2021]])^(1/(Table2[[#Headers],[2024]]-Table2[[#Headers],[2021]])))-1","v":3.4607784348449799E-2}]
{"$rows_left_out":33}
{"sheet":"Gasoline + Alts Forecast","index":8,"n_rows":13,"n_cols":8,"rows_kept":13,"cut":false,"hidden":false,"merged":[]}
[]
[null,"Gasoline and Gasoline Alternatives Consumption Forecast"]
[]
[null,"Fuel Type","Unit","Citation Reference","2021","2022","2023","2024"]
[null,"Fossil Gasoline","MM Gallons","[1]",{"$f":"'Gas & Diesel Forecast Data'!K$6-E6","v":2250.835},{"$f":"'Gas & Diesel Forecast Data'!L$6-F6","v":2399.7474999999999},{"$f":"'Gas & Diesel Forecast Data'!M$6-G6","v":2453.8975},{"$f":"'Gas & Diesel Forecast Data'!N$6-H6","v":2492.7049999999999}]
[null,"Ethanol","MM Gallons","[2]",{"$f":"'Gas & Diesel Forecast Data'!K$6*E$7","v":243.16500000000002},{"$f":"'Gas & Diesel Forecast Data'!L$6*'Summary Table '!G$7","v":259.2525},{"$f":"'Gas & Diesel Forecast Data'!M$6*'Summary Table '!H$7","v":265.10250000000002},{"$f":"'Gas & Diesel Forecast Data'!N$6*'Summary Table '!I$7","v":269.29500000000002}]
[null,"Ethanol Blend Rate","%","[3]",9.7500000000000003E-2,9.7500000000000003E-2,9.7500000000000003E-2,9.7500000000000003E-2]
[null,"Total Gasoline","MM Gallons","[4]",{"$f":"SUM(E5:E6)","v":2494},{"$f":"SUM(F5:F6)","v":2659},{"$f":"SUM(G5:G6)","v":2719},{"$f":"SUM(H5:H6)","v":2762}]
{"$rows_left_out":6}
{"sheet":"Petroleum Availability","index":9,"n_rows":63,"n_cols":5,"rows_kept":63,"cut":false,"hidden":false,"merged":[]}
[]
[null,"Petroleum Production and Available Capacity (2022)"]
[]
[null,"Product",null,"Gallons (EIA)","% of barrel"]
[null,"Finished motor gasoline","[1]",19.399999999999999,{"$f":"D5/Conversions!D5","v":0.46190476190476187}]
[null,"Distillate fuel oil","[1]",13.44,{"$f":"D6/Conversions!D5","v":0.32}]
[]
[null,null,"Crude Oil Distillation Operable Capacity ","Gasoline","Diesel"]
{"$rows_left_out":56}
{"sheet":"Ethanol Availability","index":10,"n_rows":42,"n_cols":5,"rows_kept":42,"cut":false,"hidden":false,"merged":[]}
[]
[null,"Ethanol Production (2022)"]
[]
[null,"State","Number of Producers","Production Capacity","Production Capacity"]
[null,null,null," (MM gal/year)"," (Thousand Barrels/day)"]
[null,null,"[1]","[2]","[2] "]
[null,"East Coast (PADD 1)"]
[null,"New York",2,62,4.0443574690149999]
{"$rows_left_out":35}
{"sheet":"Diesel + Alts Cons Forecast","index":11,"n_rows":17,"n_cols":8,"rows_kept":17,"cut":false,"hidden":false,"merged":[]}
[]
[null,"Diesel and Diesel Alternatives Volume Consumption Forecast"]
[]
[null,"Fuel Type","Unit","Citation Reference","2021","2022","2023","2024"]
[null,"Fossil Diesel","MM Gallons","[1]",{"$f":"'Gas & Diesel Forecast Data'!K$10-SUM(E$6,E$8)","v":707.85},{"$f":"'Gas & Diesel Forecast Data'!L$10-SUM(F$6,F$8)","v":757.57500000000005},{"$f":"'Gas & Diesel Forecast Data'!M$10-SUM(G$6,G$8)","v":712.63660000000004},{"$f":"'Gas & Diesel Forecast Data'!N$10-SUM(H$6,H$8)","v":699.48130000000003}]
[null,"Biodiesel","MM Gallons","[2]",{"$f":"'Gas & Diesel Forecast Data'!K$10*E$7","v":18.150000000000002},{"$f":"'Gas & Diesel Forecast Data'!L$10*F$7","v":19.425000000000001},{"$f":"'Gas & Diesel Forecast Data'!M$10*G$7","v":40.038400000000003},{"$f":"'Gas & Diesel Forecast Data'!N$10*H$7","v":48.0137}]
[null,"Biodiesel Blend Rate","%","[3]",2.5000000000000001E-2,2.5000000000000001E-2,5.1200000000000002E-2,6.0700000000000004E-2]
[null,"Renewable Diesel","MM Gallons","[4]",{"$f":"'Gas & Diesel Forecast Data'!K$10*E$9","v":0},{"$f":"'Gas & Diesel Forecast Data'!L$10*F$9","v":0},{"$f":"'Gas & Diesel Forecast Data'!M$10*G$9","v":29.324999999999999},{"$f":"'Gas & Diesel Forecast Data'!N$10*H$9","v":43.505000000000003}]
{"$rows_left_out":10}
{"sheet":"Biodiesel Availability","index":12,"n_rows":50,"n_cols":5,"rows_kept":50,"cut":false,"hidden":false,"merged":[]}
[]
[null,"Biodiesel Production (2022)"]
[]
[null,"State","Number of Producers","Production Capacity","Production Capacity"]
[null,null,null," (MM gal/year)"," (Thousand Barrels/day)"]
[null,null,"[1]","[2]","[2]"]
[null,"East Coast PADD 1"]
[null,"Connecticut",1,35,2.2831050228310503]
{"$rows_left_out":43}
{"sheet":"Renewable Diesel Availability","index":13,"n_rows":26,"n_cols":5,"rows_kept":26,"cut":false,"hidden":false,"merged":[]}
[]
[null,"Renewable Diesel Availability (2023)"]
[]
[null,"State","Number of Producers","Production Capacity","Production Capacity"]
[null,null,null," (MM gal/year)"," (Thousand Barrels/day)"]
[null,null,null,"[1]","[1]"]
[null,"Midwest (PADD 2)"]
[null,"Kansas",1,3,0]
{"$rows_left_out":19}
{"sheet":"Electricity Cons Forecast","index":14,"n_rows":11,"n_cols":8,"rows_kept":11,"cut":false,"hidden":false,"merged":[]}
[]
[null,"Electricity Consumption Forecast"]
[]
[null,"Fuel Type","Unit","Citation Reference","2021","2022","2023","2024"]
[null,"Electricity (BEVs)","GWh","[1]",{"$f":"('Vehicle Stock Forecast'!K$39*'Washington EV Data'!$F$7)/1000000","v":109.63538},{"$f":"('Vehicle Stock Forecast'!L$39*'Washington EV Data'!$F$7)/1000000","v":138.88252985999998},{"$f":"('Vehicle Stock Forecast'!M$39*'Washington EV Data'!$F$7)/1000000","v":185.22769967999997},{"$f":"('Vehicle Stock Forecast'!N$39*'Washington EV Data'!$F$7)/1000000","v":235.67527243999999}]
[null,"Electricity (PHEVs)","GWh","[2]",{"$f":"('Vehicle Stock Forecast'!K$40*'Washington EV Data'!$F$15)/1000000","v":21.202791113439968},{"$f":"('Vehicle Stock Forecast'!L$40*'Washington EV Data'!$F$15)/1000000","v":23.651713487042286},{"$f":"('Vehicle Stock Forecast'!M$40*'Washington EV Data'!$F$15)/1000000","v":27.465565538572299},{"$f":"('Vehicle Stock Forecast'!N$40*'Washington EV Data'!$F$15)/1000000","v":31.154851192310854}]
[null,"Electricity","GWh","[3]",{"$f":"SUM(E5:E6)","v":130.83817111343996},{"$f":"SUM(F5:F6)","v":162.53424334704226},212.69326521857226,266.83012363231086]
[]
{"$rows_left_out":4}
{"sheet":"Electricity Availability","index":15,"n_rows":20,"n_cols":4,"rows_kept":20,"cut":false,"hidden":false,"merged":[]}
[]
[null,"Electricity Generation Availability (2020)"]
[]
[null,"Interconnection","State","Generation Available"]
[null,null,null,"(GWh/year)"]
[null,null,null,"[1]"]
[null,"WECC","AZ",109305.057]
[null,"WECC","CA",193074.93]
{"$rows_left_out":13}
{"sheet":"Natural Gas + RNG Forecast","index":16,"n_rows":13,"n_cols":8,"rows_kept":13,"cut":false,"hidden":false,"merged":[]}
[]
[null,"Natural Gas and Renewable Natural Gas Consumption Forecast"]
[]
[null,"Fuel Type","Unit","Citation Reference","2021","2022","2023","2024"]
[null,"Natural Gas","MM Diesel Gallons Equivalent","[1]",{"$f":"E8-E6","v":9.6855517076878603E-2},{"$f":"F8-F6","v":9.6855517076878603E-2},{"$f":"G8-G6","v":2.0469477244852055E-2},{"$f":"H8-H6","v":1.210693963460982E-2}]
[null,"Renewable Natural Gas","MM Diesel Gallons Equivalent","[2]",{"$f":"E8*E7","v":0},{"$f":"F8*F7","v":0},{"$f":"G8*G7","v":7.6386039832026548E-2},{"$f":"H8*H7","v":8.4748577442268783E-2}]
[null,"Renewable Natural Gas Blend Rate","%","[3]",0,0,0.78865966686642641,0.875]
[null,"Total Natural Gas","MM Diesel Gallons Equivalent","[4]",{"$f":"((('CNG Vehicle Registrations'!$F$7*'CNG Vehicle Registrations'!$F$8)*'Fuel Energy Consumption'!$E$10)/'Fuel Energy Consumption'!$E$15)/(10^6)","v":9.6855517076878603E-2},{"$f":"((('CNG Vehicle Registrations'!$F$7*'CNG Vehicle Registrations'!$F$8)*'Fuel Energy Consumption'!$E$10)/'Fuel Energy Consumption'!$E$15)/(10^6)","v":9.6855517076878603E-2},{"$f":"((('CNG Vehicle Registrations'!$F$7*'CNG Vehicle Registrations'!$F$8)*'Fuel Energy Consumption'!$E$10)/'Fuel Energy Consumption'!$E$15)/(10^6)","v":9.6855517076878603E-2},{"$f":"((('CNG Vehicle Registrations'!$F$7*'CNG Vehicle Registrations'!$F$8)*'Fuel Energy Consumption'!$E$10)/'Fuel Energy Consumption'!$E$15)/(10^6)","v":9.6855517076878603E-2}]
{"$rows_left_out":6}
{"sheet":"Natural Gas Availability","index":17,"n_rows":56,"n_cols":4,"rows_kept":56,"cut":false,"hidden":false,"merged":[]}
[]
[null,"Natural Gas Production (2022)"]
[]
[null,"State","Production Capacity","Production Capacity"]
[null,null,"(Million cu ft)","(Million DGE)"]
[null,null,"[1]"]
[null,"East Coast (PADD 1)"]
[null,"Florida",698,{"$f":"(C8/Conversions!$D$6)","v":5.0107681263460151}]
{"$rows_left_out":49}
{"sheet":"Renew Natural Gas Availability","index":18,"n_rows":50,"n_cols":13,"rows_kept":50,"cut":false,"hidden":false,"merged":[]}
[]
[null,"Renewable Natural Gas Production Availability (2022)"]
[]
[null,"State","Total Number of Producers","Production Volume (2021)"]
[null,null,null,"Food Waste","Landfills","Livestock","Water Treatment Facility","Total","Food Waste","Landfills","Livestock","Water Treatment Facility","Total"]
[null,null,null,"MMBtu/year","Mmbtu/year","MMBtu/year","MMBtu/year","MMBtu/year","MM DGE","MM DGE","MM DGE","MM DGE","MM DGE"]
[null,null,null,"[1]"]
[null,"East Coast (PADD 1)"]
{"$rows_left_out":43}
{"sheet":"Propane Consumption Forecast","index":19,"n_rows":8,"n_cols":8,"rows_kept":8,"cut":false,"hidden":false,"merged":[]}
[]
[null,"Propane Consumption Forecast"]
[]
[null,"Fuel Type","Unit","Citation Reference","2021","2022","2023","2024"]
[null,"Propane","MM Gallons","[1]",{"$f":"'Propane EIA Data'!F$5*'Propane EIA Data'!$F$9","v":2.0130598633889916},{"$f":"'Propane EIA Data'!G$5*'Propane EIA Data'!$F$9","v":2.3442125681889121},{"$f":"'Propane EIA Data'!H$5*'Propane EIA Data'!$F$9","v":2.5307038282604468},{"$f":"'Propane EIA Data'!I$5*'Propane EIA Data'!$F$9","v":2.5986772781930618}]
[]
[null,"Sources and Notes:"]
[null,"[1]: 'Propane Consumption Forecast.' Using Washington's historical consumption BRG has allocated the projected propane consumption using the U.S. EIA AEO Pacific Consumption Forecast. Due to an identified data limitation BRG relied upon the average allocation to Washington from 2014 through 2019."]
{"$rows_left_out":1}
{"sheet":"Propane Availability","index":20,"n_rows":32,"n_cols":5,"rows_kept":32,"cut":false,"hidden":false,"merged":[]}
[]
[null,"Propane Production Availability (2022)"]
[]
[null,"PADD","Production Volume"]
[null,null,"Natural Gas Field Plant Production","Refinery Production","Total "]
[null,null,"Thousand barrels/year","Thousand barrels/year","MM gal/year"]
[null,null,"[1]","[2]"]
[null,"East Coast (PADD 1)"]
{"$rows_left_out":25}
{"sheet":"Data Sources-->","index":21,"n_rows":0,"n_cols":0,"rows_kept":0,"cut":false,"hidden":false,"merged":[]}

{"sheet":"Gas & Diesel Forecast Data","index":22,"n_rows":22,"n_cols":21,"rows_kept":22,"cut":false,"hidden":false,"merged":[]}
[]
[null,null,"Transportation Revenue Forecast Council\nTable A. 1. Washington Motor Fuel Consumption Fiscal Year Forecast June 2022"]
[null,null,null,null,null,null,null,null,null,null,null,"Current\nBiennia"]
[null,null,null,2014,2015,2016,2017,2018,2019,2020,2021,2022,2023,2024,2025,2026,2027,2028,2029,2030,2031]
[null,null,"Million Gallons"]
[null,null,"Gasoline (June 2022 Forecast)",2716,2757,2844,2887,2966,2905,2734,2494,2659,2719,2762,2795,2815,2834,2853,2871,2890,2909]
[null,null,"Annual Percentage Change",1.4999999999999999E-2,1.4999999999999999E-2,3.1E-2,1.4999999999999999E-2,2.8000000000000001E-2,-2.1000000000000001E-2,-5.8999999999999997E-2,-8.7999999999999995E-2,6.6000000000000003E-2,2.3E-2,1.6E-2,1.2E-2,7.0000000000000001E-3,7.0000000000000001E-3,7.0000000000000001E-3,6.0000000000000001E-3,7.0000000000000001E-3,6.0000000000000001E-3]
[null,null,"Gasoline (Feb. 2022 Forecast)",2716,2757,2844,2887,2966,2905,2734,2494,2659,2719,2762,2795,2815,2834,2853,2871,2890,2909]
{"$rows_left_out":15}
{"sheet":"Vehicle Stock Forecast","index":23,"n_rows":48,"n_cols":21,"rows_kept":48,"cut":false,"hidden":false,"merged":[]}
[]
[null,"Washington Vehicle Stock Forecast"]
[null,null,null,2014,2015,2016,2017,2018,2019,2020,2021,2022,2023,2024,2025,2026,2027,2028,2029,2030,2031]
[null,"Vehicles paying Basic License Fee ($30)"]
[null,null,"Passenger Car and Cabs",4529669,4707553,4908456,5060804,5187649,5204763,5102400,5519519,5400000,5433159,5548000,5662873,5777753,5891612,5968428,6044049,6120658,6196997]
[null,null,"Motorhomes",65975,66913,68720,69000,68917,67618,64100,74078,71000,71160,71320,71486,71651,71812,71970,72124,72278,72430]
[null,null,"Travel Trailers",126313,132569,142484,149700,159651,162387,160400,194295,190000,190222,190999,192917,194895,196852,198869,200866,202923,204960]
[null,null,"Motorcycles",229822,236384,236134,231400,235531,232369,221400,245409,225000,226125,227256,228392,229534,230682,231835,232994,234159,235330]
{"$rows_left_out":41}
{"sheet":"CNG Vehicle Registrations","index":24,"n_rows":14,"n_cols":6,"rows_kept":14,"cut":false,"hidden":false,"merged":[]}
[]
[null,null,"Washington CNG Vehicle Use Analysis"]
[]
[null,null,"CNG Vehicles"]
[null,null,null,"Weighted Average Fuel Economy (MPGe)","[1]",22.869565217391305]
[null,null,null,"Average VMT per Vehicle in Washington (2019)","[2]",8811.82]
[null,null,null,"Washington Avg. Annual CNG Consumption/Vehicle (GGE)","[3]",385.30780347748686]
[null,null,null,"Total Number of CNG Vehicles","[4]",276]
{"$rows_left_out":7}
{"sheet":"Washington EV Data","index":25,"n_rows":22,"n_cols":32,"rows_kept":22,"cut":false,"hidden":false,"merged":[]}
[]
[null,null,"Washington Electric Vehicle Use Analysis",null,null,null,null,null,null,null,null,null,null,null,null,null,null,null,null,null,null,null,null,"Weighted Average Fuel Economy (Kwh/100 miles)","Average Per Capita VMT in Washington (2017)","Washington Avg. Annual Electricity Consumption/BEV (Kwh)",null,"Weighted Average Fuel Economy (kWh/100 miles)","Weighted Average Fuel Economy (kWh/mile)","Weighted Average Electric Range (Miles)","Weighted Average Electric Range Used (Miles)","Estimated Electricity Use/Year/PHEV"]
[]
[null,null,"Battery Electric Vehicles (BEV)"]
[null,null,null,"Weighted Average Fuel Economy (Kwh/100 miles)","[1]",28.934527561812704]
[null,null,null,"Average VMT per Vehicle in Washington (2019)","[2]",8811.82]
[null,null,null,"Washington Avg. Annual Electricity Consumption (kWh/BEV)","[3]",2549.66]
[]
{"$rows_left_out":15}
{"sheet":"Propane EIA Data","index":26,"n_rows":14,"n_cols":9,"rows_kept":14,"cut":false,"hidden":false,"merged":[]}
[]
[null,null,"Pacific Transportation Sector Propane Consumption Forecast"]
[null,null,"Fuel Type","Units","Source",2021,2022,2023,2024]
[null,null,"Propane","Quads","[1]",1.155E-3,1.3450000000000001E-3,1.4519999999999999E-3,1.4909999999999999E-3]
[null,null,"Propane","MM Gallons",null,{"$f":"((F4*(10^12))/'Fuel Energy Consumption'!$E$17)/1000000","v":12.886310387147162},{"$f":"((G4*(10^12)/'Fuel Energy Consumption'!$E$17)/1000000)","v":15.006136338279594},{"$f":"((H4*(10^12)/'Fuel Energy Consumption'!$E$17)/1000000)","v":16.199933058127861},{"$f":"((I4*(10^12)/'Fuel Energy Consumption'!$E$17)/1000000)","v":16.635055227044518}]
[]
[null,null,"Washington Allocation of Transportation Sector Propane Consumption in the Pacific Region"]
[null,null,"Fuel Type","Units","Source","2014-2019 Consumption Average"]
{"$rows_left_out":7}
{"sheet":"Sheet1","index":27,"n_rows":0,"n_cols":0,"rows_kept":0,"cut":false,"hidden":false,"merged":[]}

{"sheet":"Conversions","index":28,"n_rows":10,"n_cols":4,"rows_kept":10,"cut":false,"hidden":false,"merged":[]}
[]
[null,"Conversion","Source"]
[null,"Btu per 1 Scf of Natural Gas","[1]",1039]
[null,"Scf per 1 Cubic Meter of Natural Gas","[2]",35.335999999999999]
[null,"Gallons per Barrel","[3]",42]
[null,"Diesel Gallons Equivalent per 1 Scf of Natural Gas","[4]",139.30000000000001]
[]
[null,"Sources and Notes"]
{"$rows_left_out":2}