{"text_format":"1","workbook":"xlsx","n_sheets":6,"sheets":["Instructions","Main","Interim Results","Curves","Worksheet","1997Curves"],"not_rendered":{"charts":0,"images":3,"macros":1,"external_links":0,"defined_names":17,"comments":1,"pivot_tables":0},"unopened":[],"bounds":{"document_bytes":16777216,"sheet_cells":100000,"rows_first":2000,"rows_last":500,"rows_between":2000,"halvings":0,"cell_chars":16384,"cell_head_chars":4096},"cells_cut":0,"cells_raw":0,"read":"whole","date_system":"1900"}

{"sheet":"Instructions","index":0,"n_rows":38,"n_cols":1,"rows_kept":38,"cut":false,"hidden":false,"merged":[]}
[{"$f":"Main!A1","v":"A Water Quality Index for Washington State streams (Version 6: 2014.06.11)."}]
["Summary"]
["This Water Quality Index is designed to rate general water quality relative to expected quality. Monitoring results from monthly grab samples can be converted to scores ranging from 1 to 100. In general, scores less than 40 indicate water quality did not meet expectations. These are areas of highest concern. Scores of 40 to 79 indicate moderate concern, and scores of 80 and greater indicate water quality met expectations and are of lowest concern."]
["Limitations"]
["Indexes by design contain less information than the raw data that they summarize; many uses of water quality data cannot be met with an index. An index is most useful for comparative purposes (what stations have particularly poor water quality compared to expectations?) and for general questions (how is water quality in my stream?). Indexes are less suited to specific questions. Site-specific decisions should be based on an analysis of the original water quality data. This index should not be used to compare stations unless expectations are the same. In short, an index is a useful tool for \"communicating water quality information to the lay public and to legislative decision makers;\" it is not \"a complex predictive model for technical and scientific application\" (McClelland, 1974)."]
[]
["Besides being general in nature (imprecise), there are at least two reasons that any index may fail to accurately communicate water quality information. First, this index, like most indexes, is based on a pre-identified set of water quality constituents. A particular station may receive a good WQI score, and yet have water quality impaired by constituents not included in the index. Second, aggregation of data may mask short-term water quality problems. A satisfactory WQI at a particular station does not necessarily mean that water quality was always satisfactory. A good score should, however, indicate that poor water quality (for evaluated constituents, at least) was not chronic."]
["Directions"]
["This spreadsheet is designed to convert and aggregate results from grab samples from a single station and a single year to index scores (up to 12 samples).  Scores must be determined separately for additional stations or years. Twelve monthly samples are not required. Scores may be based on as little as a single sample--though this, of course, may not be sufficiently representative to accurately assess water quality. "]
[]
["There are six tabs. The first, this one, contains instructions and narrative information. The second \"Main\" tab is where you enter your data and view the index scores. The third \"Interim Results\" tab shows scores for each individual result. The fourth \"Curves\" tab contains the equations used to calculate scores. The fifth \"Worksheet\" tab is for you to use as you wish. I have used it to convert some data in text format (bottom) to numbers (top), which can then be copied to the main tab (paste special/values)--or, as in this example, the main tab is set to equal the values in the worksheet. The last \"1997Curves\" tab are the equations used in previous versions of the WQI that are based on Ecology's 1997 Water Quality Standards."]
[]
["Under the \"Main\" tab:"]
["1. Enter the station's Aquatic Life and Recreation Uses (e.g., Core/Primary; See WAC 173-201A) and Ecoregion (1-4, 6-9)."]
["2. Select Yes if you want to use the small Puget Sound streams TN and TP curves and No to use the standard TN and TP curves. The small PS curves were developed using data from King County and the City of Redmond to reflect what they consider to be naturally high TN/TP concentrations in their small streams. (Only the summer TP curves are unique to small PS streams.) Although developed for small streams in Ecoregion 2 (Puget Sound), you may try using these curves if you believe your TN and summer TP scores are  unrealistically low (poor). "]
["3. Enter the data for the year being evaluated. We use water years, but the index may be calculated on a calendar year basis."]
["4. Edit the \"Curve to Use\" numbers if desired (see the \"Curves\" tab). You may want to do this if there is a station-specific criterion different than the standard class criterion (some special curves are available in the \"Curves\" tab; you may also add your own, though you will have to unlock the worksheet to edit this tab). You might also want to change the curve numbers if you believe the default curves do not accurately reflect expected conditions for your stream. Or, for example, you may want to use the small PS TN curves but keep the standard TP curves. Keep in mind, however, that if you do not use the standard curve numbers, your results will not be comparable with other stations where standard curves were used."]
["5. Click the \"Calc Interim WQI Scores\" button. This converts individual sample results to scores (stored under the \"Interim Results\" tab) and aggregates monthly scores."]
["6. Click the \"Calc Constituent & Overall Scores\" button. This aggregates the constituent scores and determines the overall score. "]
["If you have trouble"]
{"$rows_left_out":19}
{"sheet":"Main","index":1,"n_rows":27,"n_cols":11,"rows_kept":27,"cut":false,"hidden":false,"merged":[[7,2,7,3],[1,2,1,3],[2,2,2,3],[3,2,3,3],[5,2,5,3],[6,2,6,3],[4,2,4,3]]}
["A Water Quality Index for Washington State streams (Version 6: 2014.06.11)."]
["Station: ",null,"05B070",null,null,null,null,null,null,"KEY"]
["Recreation Use:",null,"Primary",null,null,null,null,null,null,"Input                    "]
["Aquatic Life (Temperature):",null,"Core(16)",null,null,null,null,null,null,"Low Concern"]
["Aquatic Life (Oxygen):",null,"Core",null,null,null,null,null,null,"Moderate Concern"]
["Supplemental Spawning:",null,"09/01 to 07/01",null,null,null,null,null,null,"High Concern"]
["Ecoregion:",null,"2",null,null,null,"OutSeason",{"$f":"IF(class=\"Core(16)\",5,IF(class=\"Special(20)\",3,4))","v":5}]
["Small Puget Sound Stream:",null,"Yes",null,null,null,"SupSpawn",{"$f":"H7 & IF(VLOOKUP(C6,Curves!$C$235:$D$253,2,FALSE)<10, 0,) & VLOOKUP(C6,Curves!$C$235:$D$253,2,FALSE)","v":"514"}]
[null,null,"Warning: The Small PS streams setting was designed for Ecoregion 2 streams. "]
[null,"Default Curve No.:",{"$f":"VLOOKUP($C$3,Curves!$C$215:$D$217,2,FALSE)","v":51},{"$f":"VLOOKUP($C$5,Curves!$C$220:$D$225,2,FALSE)","v":26},41,{"$f":"IF($C$8=\"Yes\",272,VLOOKUP($C$7,Curves!$C$256:$D$263,2,FALSE))","v":272},{"$f":"VLOOKUP($C$7,Curves!$C$286:$D$293,2,FALSE)","v":82},{"$f":"IF(C4=\"Char(12)\",7,IF(VLOOKUP(C6,Curves!$C$235:$D$253,2,FALSE)=0,VLOOKUP(class,Curves!$C$228:$D$233,2,FALSE),H8))","v":"514"},{"$f":"IF($C$8=\"Yes\",262,VLOOKUP($C$7,Curves!$C$266:$D$273,2,FALSE))","v":262},{"$f":"VLOOKUP($C$7,Curves!$C$276:$D$283,2,FALSE)","v":92}]
[null,"Curve to Use:",{"$f":"C10","v":51},{"$f":"D10","v":26},41,272,82,"514",{"$f":"I10","v":262},92]
[null,null,"FC","Oxygen","pH","TP","TSS","Temp","TN","Turbidity","Monthly "]
[null,"Date","col/100mL","mg/L","std. Units","mg/L","mg/L","C","mg/L","NTU","Scores"]
[null,"2009-10-20",25,10.19,7.16,4.4900000000000002E-2,24,9.6999999999999993,0.14899999999999999,14,{"$f":"'Interim Results'!O14","v":81.073416742828314}]
[null,"2009-11-17",33,12,null,0.47699999999999998,529,6,2.31,300,{"$f":"'Interim Results'!O15","v":32.651119551877407}]
[null,"2009-12-15",8,13.1,7.44,2.2800000000000001E-2,10,3.1,3.4380000000000002,7.4,{"$f":"'Interim Results'!O16","v":96.779219097392755}]
[null,"2010-01-26",1,12.6,7.37,1.43E-2,6,4.7,1.02,6.1,{"$f":"'Interim Results'!O17","v":98.301354808892825}]
[null,"2010-02-23",1,13.3,7.57,1.1599999999999999E-2,4,5.0999999999999996,0.52700000000000002,2.7,{"$f":"'Interim Results'!O18","v":99.68457271471938}]
[null,"2010-03-16",2,12.5,7.48,1.1299999999999999E-2,6,7.4,0.33800000000000002,5.0999999999999996,{"$f":"'Interim Results'!O19","v":98.825529495659381}]
[null,"2010-04-20",4,12.4,7.18,2.0400000000000001E-2,17,7.5,0.32800000000000001,12,{"$f":"'Interim Results'!O20","v":95.304687386729157}]
{"$rows_left_out":8}
{"sheet":"Interim Results","index":2,"n_rows":25,"n_cols":15,"rows_kept":25,"cut":false,"hidden":false,"merged":[]}
[]
[]
[]
[]
[]
[]
[]
[]
[]
[]
[]
[null,"Interim Scores: Individual results converted to WQI scores.",null,null,null,null,null,null,null,null,"Nutrient","Sediment",null,null,"Monthly"]
[null,{"$f":"Main!B13","v":"Date"},{"$f":"Main!C12","v":"FC"},{"$f":"Main!D12","v":"Oxygen"},{"$f":"Main!E12","v":"pH"},{"$f":"Main!F12","v":"TP"},{"$f":"Main!G12","v":"TSS"},{"$f":"Main!H12","v":"Temp"},{"$f":"Main!I12","v":"TN"},{"$f":"Main!J12","v":"Turbidity"},"Score","Score","Penalty","Count","Score"]
[1,{"$f":"Main!B14","v":"2009-10-20"},92.884928005491602,86.731628683000054,95.190783168000166,100,67.02192570924602,91.903843000000009,100,70.427092828389959,{"$f":"IF(Main!F14*Main!I14=0,MIN(F14,I14),IF(Main!I14/Main!F14<10,I14,IF(Main!I14/Main!F14>20,F14,MIN(F14,I14))))","v":100},{"$f":"IF(G14*J14=0,MAX(G14,J14),2/(1/G14+1/J14))","v":68.682329400119528},{"$f":"IF(AND(C14<80,C14>0),(85-C14)/2,0)+IF(AND(D14<80,D14>0),(85-D14)/2,0)+IF(AND(E14<80,E14>0),(85-E14)/2,0)+IF(AND(H14<80,H14>0),(85-H14)/2,0)+IF(AND(K14<80,K14>0),IF((85-K14)/2>20,20,(85-K14)/2),0)+IF(AND(L14<80,L14>0),IF((85-L14)/2>20,20,(85-L14)/2),0)","v":8.158835299940236},{"$f":"COUNTIF(C14:E14,\">0\")+COUNTIF(H14:H14,\">0\")+COUNTIF(K14:L14,\">0\")","v":6},{"$f":"IF(N14=0,0,IF((C14+D14+E14+H14+K14+L14)/N14-M14<1,1,(C14+D14+E14+H14+K14+L14)/N14-M14))","v":81.073416742828314}]
[2,{"$f":"Main!B15","v":"2009-11-17"},90.714346078773772,98.768320000000045,null,5.1296672663062832,25.065228080821598,100,47.702810479999997,15.708260308449098,{"$f":"IF(Main!F15*Main!I15=0,MIN(F15,I15),IF(Main!I15/Main!F15<10,I15,IF(Main!I15/Main!F15>20,F15,MIN(F15,I15))))","v":47.702810479999997},19.313095000613277,38.648594760000002,5,32.651119551877407]
[3,{"$f":"Main!B16","v":"2009-12-15"},99.718671523650258,100,99.023671808000017,90.311808263168658,92.716143959636312,100,3.5426103391999897,90.551743664196565,{"$f":"IF(Main!F16*Main!I16=0,MIN(F16,I16),IF(Main!I16/Main!F16<10,I16,IF(Main!I16/Main!F16>20,F16,MIN(F16,I16))))","v":90.311808263168658},91.621162989537694,0,6,96.779219097392755]
[4,{"$f":"Main!B17","v":"2010-01-26"},100,100,98.211372432000076,97.154892076064527,96.481760156409109,100,97.758494719999987,92.486440823630119,{"$f":"IF(Main!F17*Main!I17=0,MIN(F17,I17),IF(Main!I17/Main!F17<10,I17,IF(Main!I17/Main!F17>20,F17,MIN(F17,I17))))","v":97.154892076064527},94.441864345292373,0,6,98.301354808892825]
[5,{"$f":"Main!B18","v":"2010-02-23"},100,100,99.838671638999926,99.68641544930999,98.668154200511054,100,100,98.496693307409416,{"$f":"IF(Main!F18*Main!I18=0,MIN(F18,I18),IF(Main!I18/Main!F18<10,I18,IF(Main!I18/Main!F18>20,F18,MIN(F18,I18))))","v":99.68641544930999},98.582349200006419,0,6,99.68457271471938]
[6,{"$f":"Main!B19","v":"2010-03-16"},100,100,99.444165312000109,99.979933136918689,96.481760156409109,98.250531999999993,100,94.104973543329223,{"$f":"IF(Main!F19*Main!I19=0,MIN(F19,I19),IF(Main!I19/Main!F19<10,I19,IF(Main!I19/Main!F19>20,F19,MIN(F19,I19))))","v":99.979933136918689},95.278546525037385,0,6,98.825529495659381]
[7,{"$f":"Main!B20","v":"2010-04-20"},100,100,95.516179871999952,92.093723121371653,87.610803132145975,98.007874999999999,100,84.85395763783724,{"$f":"IF(Main!F20*Main!I20=0,MIN(F20,I20),IF(Main!I20/Main!F20<10,I20,IF(Main!I20/Main!F20>20,F20,MIN(F20,I20))))","v":92.093723121371653},86.210346327003307,0,6,95.304687386729157]
{"$rows_left_out":6}
{"sheet":"Curves","index":3,"n_rows":297,"n_cols":14,"rows_kept":297,"cut":false,"hidden":false,"merged":[]}
["ParamClassID","param","WQIClass","Glacial","Criterion","Start Month","End Month","LowerResult","UpperResult","a","b","b2","Comments"]
[51,"FC","Primary",false,100,1,13,0,999999,103.59,0.81005499999999997,-1.28485,"WQI=LN(x)"]
[52,"FC","Secondary",false,200,1,13,0,999999,102.944,2.5972300000000001,-1.3061199999999999,"WQI=LN(x)"]
[53,"FC","Extraordinary",false,50,1,13,0,999999,103.05,-0.58320000000000005,-1.3564099999999999,"WQI=LN(x)"]
[21,"Oxygen","Spawning",false,8,1,13,0,12,-67.025499999999994,27.5473,-1.14663,""]
[21,"Oxygen","Spawning",false,8,1,13,12.000999999999999,99,100,0,0,""]
[22,"Oxygen","Rearing",false,6.5,1,13,0,8.5,-109.509,43.652900000000002,-2.23081,""]
[22,"Oxygen","Rearing",false,6.5,1,13,8.5009999999999994,99,100,0,0,""]
[23,"Oxygen","Char",false,9.5,1,13,12.500999999999999,99,100,0,0,""]
[23,"Oxygen","Char",false,9.5,1,13,0,12.5,-130.69999999999999,33.81,-1.22397,""]
[24,"Oxygen","S1",false,8,9.5,13,12.000999999999999,99,100,0,0,""]
[24,"Oxygen","S1",false,8,9.5,13,0,12,-67.025499999999994,27.5473,-1.14663,""]
[24,"Oxygen","S1",false,5,6,9.5,7.5010000000000003,99,100,0,0,""]
[24,"Oxygen","S1",false,5,6,9.5,0,7.5,-64.444400000000002,42.777799999999999,-2.7778,"Limited to >5.0 Jun1 through Sep15. (This evaluates ALL of Sep against 5.0 criterion)"]
[24,"Oxygen","S1",false,8,1,6,0,12,-67.025499999999994,27.5473,-1.14663,""]
[24,"Oxygen","S1",false,8,1,6,12.000999999999999,99,100,0,0,""]
[25,"Oxygen","S2",false,5,1,13,0,7.5,-64.444400000000002,42.777799999999999,-2.7778,"Limited to >5.0  year round"]
[25,"Oxygen","S2",false,5,1,13,7.5010000000000003,99,100,0,0,""]
[26,"Oxygen","Core",false,9.5,1,13,0,12.5,-130.69999999999999,33.81,-1.22397,""]
[26,"Oxygen","Core",false,9.5,1,13,12.5,99,100,0,0,""]
{"$rows_left_out":278}
{"sheet":"Worksheet","index":4,"n_rows":30,"n_cols":32,"rows_kept":30,"cut":false,"hidden":false,"merged":[[16,31,16,32],[17,31,17,32],[16,25,16,26],[17,25,17,26],[16,27,16,28],[17,27,17,28],[16,29,16,30],[17,29,17,30],[16,19,16,20],[17,19,17,20],[16,21,16,22],[17,21,17,22],[16,23,16,24],[17,23,17,24],[16,13,16,14],[17,13,17,14],[16,15,16,16],[17,15,17,16],[16,17,16,18],[17,17,17,18],[16,7,16,8],[17,7,17,8],[16,9,16,10],[17,9,17,10],[16,11,16,12],[17,11,17,12],[16,1,17,1],[16,2,17,2],[16,3,16,4],[17,3,17,4],[16,5,16,6],[17,5,17,6]]}
["Data can be pasted here from databases or web sites (e.g., http://www.ecy.wa.gov/programs/eap/fw_riv/rv_main.html), "]
["cleaned up, then pasted to the \"Main\" worksheet."]
["STATION","date","Fecal Coliform Bacteria","Oxygen","pH","Phosphorus, Total","Suspended Solids","Temperature","Total Persulf Nitrogen","Turbidity"]
[{"$f":"A18","v":"01A050"},{"$f":"B19","v":"2009-10-20"},{"$f":"H19","v":25},{"$f":"P19","v":10.19},{"$f":"R19","v":7.16},{"$f":"AB19","v":4.4900000000000002E-2},{"$f":"V19","v":24},{"$f":"X19","v":9.6999999999999993},{"$f":"AD19","v":0.39400000000000002},{"$f":"AF19","v":14}]
["01A050",{"$f":"B20","v":"2009-11-17"},{"$f":"H20","v":33},{"$f":"P20","v":12},null,{"$f":"AB20","v":0.47699999999999998},{"$f":"V20","v":529},{"$f":"X20","v":6},{"$f":"AD20","v":0.19500000000000001},{"$f":"AF20","v":300}]
["01A050","2009-12-15",8,13.1,{"$f":"R21","v":7.44},2.2800000000000001E-2,10,3.1,0.27100000000000002,7.4]
["01A050","2010-01-26",1,12.6,7.37,1.43E-2,6,4.7,0.22500000000000001,6.1]
["01A050","2010-02-23",1,13.3,7.57,1.1599999999999999E-2,4,5.0999999999999996,0.19400000000000001,2.7]
["01A050","2010-03-16",2,12.5,7.48,1.1299999999999999E-2,6,7.4,0.16,5.0999999999999996]
["01A050","2010-04-20",4,12.4,7.18,2.0400000000000001E-2,17,7.5,0.121,12]
["01A050","2010-05-18",7,11.4,7.51,1.0800000000000001E-2,6,10.3,9.7000000000000003E-2,3.8]
["01A050","2010-06-22",2,10.9,7.6,8.0999999999999996E-3,3,14,8.8999999999999996E-2,1.9]
["01A050","2010-07-27",4,10.3,8.4600000000000009,9.7999999999999997E-3,7,20.100000000000001,6.2E-2,2]
["01A050","2010-08-24",4,10.9,8.42,1.2200000000000001E-2,2,19.3,9.6000000000000002E-2,0.7]
["01A050","2010-09-28",44,10.6,7.21,3.9399999999999998E-2,35,13.2,0.20100000000000001,22]
[]
["STATION","date","time","COND",null,"DOC",null,"FC",null,"NH3_N",null,"NO2_NO3",null,"OP_DIS",null,"OXYGEN",null,"PH",null,"PRESS",null,"SUSSOL",null,"TEMP",null,"TOC",null,"TP_P",null,"TPN",null,"TURB"]
["01A050",null,null,"(umhos/cm)",null,"(mg/L)",null,"(#/100ml)",null,"(mg/L)",null,"(mg/L)",null,"(mg/L)",null,"(mg/L)",null,"(pH)",null,"(mm/Hg)",null,"(mg/L)",null,"(deg C)",null,"(mg/L)",null,"(mg/L)",null,"(mg/L)",null,"(NTU)"]
["01A050","2009-10-20","12:45:00",56,null,null,null,25,null,4.4999999999999998E-2,null,0.315,null,1.2699999999999999E-2,null,10.19,null,7.16,null,763.27,null,24,null,9.6999999999999993,null,null,null,4.4900000000000002E-2,null,0.39400000000000002,null,14]
["01A050","2009-11-17","12:40:00",27,null,null,null,33,"J",1.2999999999999999E-2,null,0.17100000000000001,null,5.3E-3,null,12,null,null,null,758.19,null,529,"J",6,null,null,null,0.47699999999999998,null,0.19500000000000001,null,300]
{"$rows_left_out":11}
{"sheet":"1997Curves","index":5,"n_rows":88,"n_cols":13,"rows_kept":88,"cut":false,"hidden":false,"merged":[]}
["ParamClassID","param","WQIClass","Glacial","Criterion","Start Month","End Month","LowerResult","UpperResult","a","b","b2","Comments"]
[51,"FC","A","No",100,1,12,0,999999,103.59,0.81005499999999997,-1.28485,"WQI=LN(x)"]
[53,"FC","AA","No",50,1,12,0,999999,103.25,-0.58320000000000005,-1.3564099999999999,"WQI=LN(x)"]
[52,"FC","B","No",200,1,12,0,999999,102.944,2.5972300000000001,-1.3061199999999999,"WQI=LN(x)"]
[21,"Oxygen","A","No",8,1,12,0,12,-67.325500000000005,27.5473,-1.14663,""]
[21,"Oxygen","A","No",8,1,12,12.000999999999999,99,100,0,0,""]
[23,"Oxygen","AA","No",9.5,1,12,0,12.5,-131.19999999999999,33.81,-1.22397,""]
[23,"Oxygen","AA","No",9.5,1,12,12.500999999999999,99,100,0,0,""]
[22,"Oxygen","B","No",6.5,1,12,0,8.5,-109.509,43.652900000000002,-2.23081,""]
[22,"Oxygen","B","No",6.5,1,12,8.5009999999999994,99,100,0,0,""]
[24,"Oxygen","S","No",5,6,9,0,7.5,-64.444400000000002,42.777799999999999,2.7778,"Limited to >5.0 Jun1 through Sep15. (This evaluates ALL of Sep against 5.0 criterion)"]
[24,"Oxygen","S","No",5,6,9,7.5010000000000003,99,100,0,0,""]
[24,"Oxygen","S","No",8,1,5,0,12,-62.325499999999998,27.5473,-1.14663,""]
[24,"Oxygen","S","No",8,1,5,12.000999999999999,99,100,0,0,""]
[24,"Oxygen","S","No",8,10,12,0,12,-62.325499999999998,27.5473,-1.14663,""]
[24,"Oxygen","S","No",8,10,12,12.000999999999999,99,100,0,0,""]
[25,"Oxygen","S2","No",5,1,12,0,7.5,-64.444400000000002,42.777799999999999,2.7778,"Limited to >5.0  year round"]
[25,"Oxygen","S2","No",5,1,12,7.5010000000000003,99,100,0,0,""]
[41,"pH","A","No",6.5,1,12,4,7.5,-531.42200000000003,158.619,-9.9267199999999995,""]
[41,"pH","A","No",8.5,1,12,7.5010000000000003,9.9,-338.91199999999998,128.62700000000001,-9.3308900000000001,""]
{"$rows_left_out":68}