{"text_format":"1","workbook":"xlsx","n_sheets":4,"sheets":["EtOH Summary","EtOH","EF Tables","Fuel_Specs"],"not_rendered":{"charts":0,"images":3,"macros":1,"external_links":3,"defined_names":45,"comments":2,"pivot_tables":0},"unopened":[],"bounds":{"document_bytes":16777216,"sheet_cells":100000,"rows_first":2000,"rows_last":500,"rows_between":2000,"halvings":0,"cell_chars":16384,"cell_head_chars":4096},"cells_cut":0,"cells_raw":0,"read":"whole","date_system":"1900"}

{"sheet":"EtOH Summary","index":0,"n_rows":32,"n_cols":15,"rows_kept":32,"cut":false,"hidden":false,"merged":[[0,2,1,7],[7,9,7,10],[6,2,6,3],[2,3,2,5],[2,6,2,7],[4,3,4,7],[7,6,7,7],[7,2,7,4]]}
[null,null,"Summary of the Tier 1 Starch and Fiber Ethanol Pathway(s) \nRelease Date:  November 28, 2022"]
[]
[null,null,"Applicant:",{"$f":"IF(EtOH!D21=\"\",\"\",EtOH!D21)","v":""},null,null,{"$f":"CONCATENATE(\"Location:  \",EtOH!D24)","v":"Location:  "}]
[null,null,"Application Number",{"$f":"IF(EtOH!H21=\"\",\"\",EtOH!H21)","v":""}]
[null,null,"Description:",{"$f":"IF(EtOH!G24=\"\",\"\",EtOH!G24)","v":""}]
[]
[null,null,"Feedstock Production Electricity Mix",null,"1- U.S Ave Mix",null,"Fuel Production Electricity Mix",{"$f":"EtOH!BM29","v":"2-WAMX Mix"}]
[null,null,"Feedstock Production",null,null,null,"Fuel Production",null,null,"Different Scenarios of Starch Ethanol Production",null,"Carbon Intensity (gCO2e/MJ)","Conservative Margin of Safety (gCO2e/MJ)","Total Carbon Intensity (gCO2e/MJ)","Correspondent Volumes (denatured gallons)"]
[null,null,"Feedstock Production","Column2","Column1",null,"Fuel Production","Column1",null,"Different Scenarios of Ethanol Production","Column1","Carbon Intensity, g/MJ","Column3","Column2","Correspondent Volumes, gallons"]
[null,null,"Corn Use, bushels",null,{"$f":"EtOH!D57","v":0},null,"Total Undenatured Ethanol, gallons",{"$f":"EtOH!AX57","v":0},null,null,"Dry DG",{"$f":"EtOH!D12","v":0},0,{"$f":"Table13[[#This Row],[Carbon Intensity, g/MJ]]+Table13[[#This Row],[Column3]]","v":0},{"$f":"EtOH!AG75","v":0}]
[null,null,"Sorghum Use, bushels",null,{"$f":"EtOH!L57","v":0},null,"Total Undenatured Starch Ethanol, gallons",{"$f":"EtOH!AE69+EtOH!AE70","v":0},null,"Corn Ethanol","Modified DG",{"$f":"EtOH!D14","v":0},0,{"$f":"Table13[[#This Row],[Carbon Intensity, g/MJ]]+Table13[[#This Row],[Column3]]","v":0},{"$f":"EtOH!AG76","v":0}]
[null,null,"Ethanol Yield, gal/bushels",null,{"$f":"EtOH!E80","v":0},null,"Total Undenatured Fiber Ethanol, gallons",{"$f":"EtOH!BE57","v":0},null,null,"Wet DG",{"$f":"EtOH!D16","v":0},0,{"$f":"Table13[[#This Row],[Carbon Intensity, g/MJ]]+Table13[[#This Row],[Column3]]","v":0},{"$f":"EtOH!AG77","v":0}]
[]
[null,null,"Feedstock Transport (Weighted Average)",null,null,null,"Energy Consumption",null,null,null,"Dry DG",{"$f":"EtOH!G12","v":0},0,{"$f":"Table13[[#This Row],[Carbon Intensity, g/MJ]]+Table13[[#This Row],[Column3]]","v":0},{"$f":"EtOH!AJ75","v":0}]
[null,null,"Corn Transport by HD Truck, miles",null,{"$f":"EtOH!H57","v":"0"},null,"Natural, HHV in MMBtu",{"$f":"EtOH!BG57","v":0},null,"Sorghum Ethanol","Modified DG",{"$f":"EtOH!G14","v":0},0,{"$f":"Table13[[#This Row],[Carbon Intensity, g/MJ]]+Table13[[#This Row],[Column3]]","v":0},{"$f":"EtOH!AJ76","v":0}]
[null,null,"Corn Transport by Rail, miles",null,{"$f":"EtOH!J57","v":"0"},null,"Biogas, HHV in MMBtu",{"$f":"EtOH!BH57","v":0},null,null,"Wet DG",{"$f":"EtOH!G16","v":0},0,{"$f":"Table13[[#This Row],[Carbon Intensity, g/MJ]]+Table13[[#This Row],[Column3]]","v":0},{"$f":"EtOH!AJ77","v":0}]
[null,null,null,null,null,null,"Biomass, Tons",{"$f":"EtOH!BI57","v":0}]
[null,null,"Sorghum Transport by HD Truck, miles",null,{"$f":"EtOH!P57","v":"0"},null,"Electricity, kWh",{"$f":"EtOH!BL57","v":0},null,"Corn/Sorghum Fiber Ethanol",null,{"$f":"EtOH!J10","v":0},0,{"$f":"Table13[[#This Row],[Carbon Intensity, g/MJ]]+Table13[[#This Row],[Column3]]","v":0},{"$f":"EtOH!AG78","v":0}]
[null,null,"Sorghum Transport by Rail, miles",null,{"$f":"EtOH!R57","v":"0"},null,"Other Electricity, kWh",{"$f":"EtOH!BM57","v":0}]
[null,null,null,null,null,null,null,null,null,"Corn Ethanol","Composite ",{"$f":"IFERROR((L10*O10+L11*O11+L12*O12)/O20,0)","v":0},0,{"$f":"Table13[[#This Row],[Carbon Intensity, g/MJ]]+Table13[[#This Row],[Column3]]","v":0},{"$f":"EtOH!AE75","v":0}]
[null,null,"Co-Product Yield, bone-dry lb./gal",null,{"$f":"EtOH!AS57","v":0},null,"Chemical Usage for Cellulosic",null,null,"Sorghum Ethanol","Composite",{"$f":"IFERROR((L14*O14+L15*O15+L16*O16)/O21,0)","v":0},0,{"$f":"Table13[[#This Row],[Carbon Intensity, g/MJ]]+Table13[[#This Row],[Column3]]","v":0},{"$f":"EtOH!AE76","v":0}]
[null,null,"Dry Distiller Grains, tons",null,{"$f":"EtOH!T57","v":0},null,"Cellulosic Enzyme, lbs.",{"$f":"EtOH!BB57","v":0}]
[null,null,"Moisture, %",null,{"$f":"EtOH!W57","v":0}]
[null,null,"Drying Energy, HHV in MMBtu",null,{"$f":"EtOH!X57","v":0},null,"Fuel Transport"]
[null,null,"Modified Distiller Grains, tons",null,{"$f":"EtOH!Z57","v":0},null,"By HD Truck, miles",{"$f":"EtOH!BO35","v":0}]
[null,null,"Moisture, %",null,{"$f":"EtOH!AC57","v":0},null,"By Rail, miles",{"$f":"EtOH!BO33","v":0}]
[null,null,"Drying Energy, HHV in MMBtu",null,{"$f":"EtOH!AD57","v":0}]
[null,null,"Wet Distiller Grains, tons",null,{"$f":"EtOH!AF57","v":0},null,"Denaturant Usage",{"$f":"IFERROR(EtOH!AY57/EtOH!AU57,0)","v":0}]
[null,null,"Moisture, %",null,{"$f":"EtOH!AI57","v":0},null,"Denaturant, gallons",{"$f":"EtOH!AY57","v":0}]
[null,null,"Syrup DGS, tons",null,{"$f":"EtOH!AK57","v":0}]
{"$rows_left_out":3}
{"sheet":"EtOH","index":1,"n_rows":113,"n_cols":71,"rows_kept":113,"cut":false,"hidden":false,"merged":[[6,68,6,70],[72,29,72,36],[78,29,78,30],[76,8,76,10],[76,4,76,7],[75,1,75,10],[76,2,76,3],[90,2,90,3],[89,2,89,3],[81,2,81,3],[79,2,79,3],[67,4,67,5],[67,2,67,3],[91,2,91,3],[105,2,105,3],[107,2,107,3],[109,2,109,3],[96,2,96,3],[93,2,93,3],[95,2,95,3],[97,2,97,3],[103,2,103,3],[98,2,98,3],[100,2,100,3],[1,4,1,10],[23,1,23,2],[20,1,20,2],[11,4,11,5],[12,1,12,2],[12,4,12,5],[13,1,13,2],[13,4,13,5],[14,1,14,2],[22,1,22,2],[21,1,21,2],[20,3,20,5],[14,4,14,5],[15,1,15,2],[5,1,5,2],[11,1,11,2],[8,1,8,9],[9,1,9,2],[9,4,9,5],[9,7,9,8],[10,1,10,2],[10,4,10,5],[10,7,10,8],[30,65,30,66],[29,51,29,56],[29,65,29,66],[29,24,29,29],[29,30,29,34],[29,35,29,39],[66,39,66,40],[67,41,67,44],[67,25,67,28],[64,1,64,68],[58,65,58,66],[67,45,67,48],[67,12,67,13],[67,6,67,7],[25,4,25,7],[28,1,28,5],[29,1,29,5],[59,62,60,62],[59,59,60,59],[29,8,29,9],[29,18,29,23],[28,6,28,9],[59,60,60,60],[28,58,28,63],[29,45,29,49],[28,45,28,56],[29,14,29,15],[28,10,28,13],[29,16,29,17],[30,14,30,17],[30,6,30,9],[67,8,67,9],[67,10,67,11],[66,29,66,36],[66,37,66,38],[24,3,24,7],[15,4,15,5],[40,65,42,66],[29,58,29,64],[29,40,29,43],[29,10,29,13],[16,4,16,5],[28,18,28,44],[19,1,19,7],[21,3,21,7],[22,3,22,7],[23,3,23,4],[23,6,23,7],[24,1,24,2],[28,14,28,17],[16,1,16,2]]}
[]
[]
[]
[]
[]
[]
[null,null,null,"Tier 1 Simplified CI Calculator for Starch and Fiber Ethanol",null,null,null,null,null,null,null,null,null,null,null,null,null,null,null,null,null,null,null,null,null,null,null,null,null,null,null,null,null,null,null,null,null,null,null,null,null,null,null,null,null,null,null,null,null,null,null,null,null,null,null,null,null,null,null,null,null,null,null,null,null,null,null,null,"This map shows Emissions & Generation Resource Integrated Database (eGRID) "]
[null,null,null,null,null,null,null,null,null,null,null,null,null,null,null,null,null,null,null,null,null,null,null,null,null,null,null,null,null,null,null,null,null,null,null,null,null,null,null,null,null,null,null,null,null,null,null,null,null,null,null,null,null,null,null,null,null,null,null,null,null,null,null,null,null,null,null,null,1,"US Average","US Average"]
[null,"Pathway Summary and Estimated CI (g/MJ)",null,null,null,null,null,null,null,null,null,"Yellow Cells require user input",null,null,null,null,null,null,null,null,null,null,null,null,null,null,null,null,null,null,null,null,null,null,null,null,null,null,null,null,null,null,null,null,null,null,null,null,null,null,null,null,null,null,null,null,null,null,null,null,null,null,null,null,null,null,null,null,2,"WAMX","Western Electricity Coordinating Council - California"]
[null,"Corn Ethanol Composite CI, g/MJ ",null,{"$f":"IFERROR((D12*D13+D14*D15+D16*D17)/AE75,0)","v":0},"Sorghum Ethanol (Composite CI), g/MJ ",null,{"$f":"IFERROR((G12*G13+G14*G15+G16*G17)/AE76,0)","v":0},"Corn/Sorghum Fiber Ethanol CI, g/MJ",null,{"$f":"IF(BE57=0,0,(H89+H93+H97+H103+H105+H107+H109+H99+H101)*'EF Tables'!D79+(H111+H112+H113))","v":0},null,"Light Blue Cells show CI results ",null,null,null,null,null,null,null,null,null,null,null,null,null,null,null,null,null,null,null,null,null,null,null,null,null,null,null,null,null,null,null,null,null,null,null,null,null,null,null,null,null,null,null,null,null,null,null,null,null,null,null,null,null,null,null,null,3,"CAMX","Western Electricity Coordinating Council - California"]
[null,"Denatured Volume, gal",null,{"$f":"AE75","v":0},"Denatured Volume, gal ",null,{"$f":"AE76","v":0},"Denatured Ethanol Volume, gal ",null,{"$f":"AE78","v":0},null,"Green Cells show the calculation button",null,null,null,null,null,null,null,null,null,null,null,null,null,null,null,null,null,null,null,null,null,null,null,null,null,null,null,null,null,null,null,null,null,null,null,null,null,null,null,null,null,null,null,null,null,null,null,null,null,null,null,null,null,null,null,null,4,"NWPP","Western Electricity Coordinating Council - Northwest"]
[null,"Corn Ethanol (Dry DGS) CI, g/MJ",null,{"$f":"IF(OR(D57=0,T57=0),0,(E82+E84+E86+E93+E95+E97+E103+E105+E107+E109+E99+E101)*'EF Tables'!D79+(E111+E112+E113))","v":0},"Sorghum Ethanol (Dry DGS) CI, g/MJ",null,{"$f":"IF(OR(T57=0,L57=0),0,(I82+I84+I86+I93+I95+I97+I103+I105+I107+I109+I99+I101)*'EF Tables'!D79+(I111+I112+I113))","v":0},null,null,null,null,"Gray Cells are Calculated Values",null,null,null,null,null,null,null,null,null,null,null,null,null,null,null,null,null,null,null,null,null,null,null,null,null,null,null,null,null,null,null,null,null,null,null,null,null,null,null,null,null,null,null,null,null,null,null,null,null,null,null,null,null,null,null,null,5,"AZNM","Western Electricity Coordinating Council - Southwest"]
[null,"Denatured Volume, gal",null,{"$f":"AG75","v":0},"Denatured Volume, gal",null,{"$f":"AJ75","v":0},null,null,null,null,null,null,null,null,null,null,null,null,null,null,null,null,null,null,null,null,null,null,null,null,null,null,null,null,null,null,null,null,null,null,null,null,null,null,null,null,null,null,null,null,null,null,null,null,null,null,null,null,null,null,null,null,null,null,null,null,null,6,"RMPA","Western Electricity Coordinating Council - Rockies"]
[null,"Corn Ethanol (Modified DGS) CI, g/MJ",null,{"$f":"IF(OR(D57=0,Z57=0),0,(F82+F84+F86+F93+F95+F97+F103+F105+F107+F109+F99+F101)*'EF Tables'!D79+(F111+F112+F113))","v":0},"Sorghum Ethanol (Modified DGS) CI, g/MJ",null,{"$f":"IF(OR(Z57=0,L57=0),0,(J82+J84+J86+J93+J95+J97+J103+J105+J107+J109+J99+J101)*'EF Tables'!D79+(J111+J112+J113))","v":0}," "," "," ",null,null,null,null,null,null,null,null,null,null,null,null,null,null,null,null,null,null,null,null,null,null,null,null,null,null,null,null,null,null,null,null,null,null,null,null,null,null,null,null,null,null,null,null,null,null,null,null,null,null,null,null,null,null,null,null,null,null,7,"MROW","Midwest Reliability Organization West"]
[null,"Denatured Volume, gal",null,{"$f":"AG76","v":0},"Denatured Volume, gal",null,{"$f":"AJ76","v":0}," "," "," ",null,null,null,null,null,null,null,null,null,null,null,null,null,null,null,null,null,null,null,null,null,null,null,null,null,null,null,null,null,null,null,null,null,null,null,null,null,null,null,null,null,null,null,null,null,null,null,null,null,null,null,null,null,null,null,null,null,null,8,"SPNO","SERC Reliability Corporation - North"]
[null,"Corn Ethanol (Wet DGS) CI, g/MJ",null,{"$f":"IF(OR(D57=0,AF57=0), 0,(G82+G84+G86+G93+G95+G97+G103+G105+G107+G109+G99+G101)*'EF Tables'!D79+(G111+G112+G113))","v":0},"Sorghum Ethanol (Wet DGS) CI, g/MJ",null,{"$f":"IF(OR(AF57=0,L57=0),0,(K82+K84+K86+K93+K95+K97+K103+K105+K107+K109+K99+K101)*'EF Tables'!D79+(K111+K112+K113))","v":0}," "," "," ",null,null,null,null,null,null,null,null,null,null,null,null,null,null,null,null,null,null,null,null,null,null,null,null,null,null,null,null,null,null,null,null,null,null,null,null,null,null,null,null,null,null,null,null,null,null,null,null,null,null,null,null,null,null,null,null,null,null,9,"SPSO","SERC Reliability Corporation - South"]
[null,"Denatured Volume, gal",null,{"$f":"AG77","v":0},"Denatured Volume, gal",null,{"$f":"AJ77","v":0}," "," "," ",null,null,null,null,null,null,null,null,null,null,null,null,null,null,null,null,null,null,null,null,null,null,null,null,null,null,null,null,null,null,null,null,null,null,null,null,null,null,null,null,null,null,null,null,null,null,null,null,null,null,null,null,null,null,null,null,null,null,10,"ERCT","Electric Reliability Council of Texas - All"]
[null,null,null,null,null,null,null,null,null,null,null,null,null,null,null,null,null,null,null,null,null,null,null,null,null,null,null,null,null,null,null,null,null,null,null,null,null,null,null,null,null,null,null,null,null,null,null,null,null,null,null,null,null,null,null,null,null,null,null,null,null,null,null,null,null,null,null,null,11,"MROE","Midwest Reliability Organization East"]
[null,null,null,null,null,null,null,null,null,null,null,null,null,null,null,null,null,null,null,null,null,null,null,null,null,null,null,null,null,null,null,null,null,null,null,null,null,null,null,null,null,null,null,null,null,null,null,null,null,null,null,null,null,null,null,null,null,null,null,null,null,null,null,null,null,null,null,null,12,"SRMW","SERC Reliability Corporation - Midwest"]
[null,"Section 1.  Applicant Information",null,null,null,null,null,null,null,null,null,null,null,null,null,null,null,null,null,null,null,null,null,null,null,null,null,null,null,null,null,null,null,null,null,null,null,null,null,null,null,null,null,null,null,null,null,null,null,null,null,null,null,null,null,null,null,null,null,null,null,null,null,null,null,null,null,null,13,"SRMV","SERC Reliability Corporation - Mississippi Valley"]
[null,"1.1. Company Name",null,null,null,null,"1.2. Application Number",null,null,null,null,null,null,null,null,null,null,null,null,null,null,null,null,null,null,null,null,null,null,null,null,null,null,null,null,null,null,null,null,null,null,null,null,null,null,null,null,null,null,null,null,null,null,null,null,null,null,null,null,null,null,null,null,null,null,null,null,null,14,"RFCM","Reliability First Corporation - Michigan"]
[null,"1.3. Company ID ",null,null,null,null,null,null,null,null,null,null,null,null,null,null,null,null,null,null,null,null,null,null,null,null,null,null,null,null,null,null,null,null,null,null,null,null,null,null,null,null,null,null,null,null,null,null,null,null,null,null,null,null,null,null,null,null,null,null,null,null,null,null,null,null,null,null,15,"RFCW","Reliability First Corporation - Midwest"]
[null,"1.4. Facility ID",null,null,null,null,null,null,null,null,null,null,null,null,null,null,null,null,null,null,null,null,null,null,null,null,null,null,null,null,null,null,null,null,null,null,null,null,null,null,null,null,null,null,null,null,null,null,null,null,null,null,null,null,null,null,null,null,null,null,null,null,null,null,null,null,null,null,16,"SRTV","SERC Reliability Corporation - Tennessee Valley"]
[null,"1.5. Ethanol Production Location \n(City, State)",null,null,null,"1.6. Application Description",null,null,null,null,null,null,null,null,null,null,null,null,null,null,null,null,null,null,null,null,null,null,null,null,null,null,null,null,null,null,null,null,null,null,null,null,null,null,null,null,null,null,null,null,null,null,null,null,null,null,null,null,null,null,null,null,null,null,null,null,null,null,17,"SRSO","SERC Reliability Corporation - South"]
[null,"1.7. Electricity Mix Region for Feedstock",null,"1-U.S Ave Mix",null,null,null,null,null,null,null,null,null,null,null,null,null,null,null,null,null,null,null,null,null,null,null,null,null,null,null,null,null,null,null,null,null,null,null,null,null,null,null,null,null,null,null,null,null,null,null,null,null,null,null,null,null,null,null,null,null,null,null,null,null,null,null,null,18,"NEWE","Northeast Power Coordinating Council - New England"]
[null,"1.8. Provisional Pathway?",null,"No",null,null,null,null,null,null,null,null,null,null,null,null,null,null,null,null,null,null,null,null,null,null,null,null,null,null,null,null,null,null,null,null,null,null,null,null,null,null,null,null,null,null,null,null,null,null,null,null,null,null,null,null,null,null,null,null,null,null,null,null,null,null,null,null,19,"NYUP","Northeast Power Coordinating Council - Upstate New York"]
[null,null,null,null,null,null,null,null,null,null,null,null,null,null,null,null,null,null,null,null,null,null,null,null,null,null,null,null,null,null,null,null,null,null,null,null,null,null,null,null,null,null,null,null,null,null,null,null,null,null,null,null,null,null,null,null,null,null,null,null,null,null,null,null,null,null,null,null,20,"RFCE","Reliability First Corporation - East"]
[null,"Section 2. Feedstock Production Data for Starch Ethanol Production",null,null,null,null,null,null,null,null,null,null,null,null,null,null,null,null,null,null,null,null,null,null,null,null,null,null,null,null,null,null,null,null,null,null,null,null,null,null,null,null,null,null,null,null,null,null,null,null,null,null,null,null,null,null,null,null,"Section 3. Fuel Production Energy Consumption and Fuel Transport Data",null,null,null,null,null,null,null,null,null,21,"NYLI","Northeast Power Coordinating Council - Long Island"]
[null,"Corn as Feedstock",null,null,null,null," Corn Transport ",null,null,null,"Sorghum as Feedstock",null,null,null,"Sorghum Transport",null,null,null,"Co-Product Production",null,null,null,null,null,null,null,null,null,null,null,null,null,null,null,null,null,null,null,null,null,null,null,null,null,null,"Fuel Production",null,null,null,null,null,null,null,null,null,null,null,null,"3.1. Electricity Mix Region for Fuel",null,null,null,null,null,"2-WAMX Mix",{"$f":"IF(BM29=\"2-User Defined Mix\",\"3.10. Enter Electricity Generation GHG Emission Factor \n(gCO2e/kWh)\",\"\")","v":""},null,null,22,"NYCW","Northeast Power Coordinating Council - New York Westchester"]
[null,"Corn Inventory",null,null,null,null,"2.6. Corn Transport Data Category",null,"User-Defined for Corn Transport",null,"Sorghum Inventory",null,null,null,"2.12. Sorghum Transport Data Category",null,"User-Defined for Sorghum Transport",null,"Dry Distiller Grains",null,null,null,null,null,"Modified Distiller Grains",null,null,null,null,null,"Wet Distiller Grains",null,null,null,null,"Syrup",null,null,null,null,"Corn/Sorghum Oil",null,null,null,null,"Starch Ethanol Production",null,null,null,null,"2.46. \nDenaturant Data Category","Cellulosic Ethanol Production",null,null,null,null,null,null,"Energy Consumption ",null,null,null,null,null,null,"Fuel Transport and Distribution",null,null,23,"SRVC","SERC Reliability Corporation - Virginia/Carolina"]
{"$rows_left_out":84}
{"sheet":"EF Tables","index":2,"n_rows":79,"n_cols":34,"rows_kept":79,"cut":false,"hidden":false,"merged":[[0,1,0,12]]}
[null,"Greenhouse Gases Emissions Factors Used in WA-GREET for Carbon Intensity Calculations\n(see \"WA-GREET for EF Table\")"]
[null,"GHG Emission Factors ","1-U.S Ave Mix","2-WAMX Mix","3-CAMX Mix","4-NWPP Mix","5-AZNM Mix","6-RMPA Mix","7-MROW Mix","8-SPNO Mix","9-SPSO Mix","10-ERCT Mix","11-MROE Mix","12-SRMW Mix","13-SRMV Mix","14-RFCM Mix","15-RFCW Mix","16-SRTV Mix","17-SRSO Mix","18-NEWE Mix","19-NYUP Mix","20-RFCE Mix","21-NYLI Mix","22-NYCW Mix","23-SRVC Mix","24-FRCC Mix","25-AKMS Mix","26-AKGD Mix","27-HIOA Mix","28-HIMS Mix","29-Brazilian Mix","30-Canadian Mix","31-ORMX Mix","32-User Defined Mix"]
[null,"Emissions from Electricity use (gCO2e/kWh) ",578.81547108787004,228.64550547041199,368.98203495539849,476.16373764191144,459.16880044914376,852.19897614032618,684.29005614750861,793.25577052723531,796.11091071314377,638.3672025198199,893.56248571959043,925.99986512528915,613.66928309105072,786.7786546446066,738.59106333639113,681.88615253075625,627.94048246799673,353.78141954175078,227.88353339618712,459.89499004632711,627.41007019082952,353.22717258193455,491.19172855757063,601.2274513040627,160.39623912489697,748.59491973645083,1145.1044253269501,682.96015864794208,181.5105027899846,166.05006134477424,462.03283199582938,{"$f":"EtOH!$BO$25","v":0}]
[]
[null,"Non-combustion (gCO2e/MJ)",{"$f":"2.239/Fuel_Specs!$I$8*Fuel_Specs!$B$17*$D$79","v":8.6694746909554699E-2}]
[null,"Enzymes and Yeast (gCO2e/MJ)",2.02]
[null,"Natiral Gas for Ethanol Production (g CO2e/MMBtu)",73411.621744961929]
[null,"Natiral Gas for Drying DGS (g CO2e/MMBtu)",73352.021744961938]
[]
[null,null,"Corn Farming, Fertilizers, N2O in soil"]
[null,null,null,"Farming","Fertilizers","N2O in soil","Total, gCO2e/bushel"]
[null,null,"VOC",0.50796653236777622,2.6136788993906119]
[null,null,"CO",4.1882508511792897,3.1793523934435308]
[null,null,"CH4",1.8429199231414202,5.8876258933381758]
[null,null,"N2O",1.8238369301727231E-2,0.77587032046168969,10.699418616296118]
[null,null,"CO2",618.71521069727191,2166.8718496917859]
[null,null,"Total, gCO2e/bushel",{"$f":"D12*Fuel_Specs!$B$17+D13*Fuel_Specs!$B$18+D14*Fuel_Specs!$B$15+D15*Fuel_Specs!$B$16+D16","v":678.38794223878824},{"$f":"E12*Fuel_Specs!$B$17+E13*Fuel_Specs!$B$18+E14*Fuel_Specs!$B$15+E15*Fuel_Specs!$B$16+E16","v":2558.4139436156215},{"$f":"F12*Fuel_Specs!$B$17+F13*Fuel_Specs!$B$18+F14*Fuel_Specs!$B$15+F15*Fuel_Specs!$B$16+F16","v":3188.4267476562432},{"$f":"SUM(D17:F17)","v":6425.2286335106528}]
[]
[null,null,"Sorghum Farming, Fertilizers, N2O in soil"]
[null,null,null,"Farming","Fertilizers","N2O is soil","Total, gCO2e/bushel"]
[null,null,"VOC",0.62376859740921908,2.8215355785189469]
[null,null,"CO",4.9311662899332873,3.5920269462934842]
[null,null,"CH4",2.0873943807254394,6.9583505708664086]
[null,null,"N2O",2.1953622897582663E-2,0.85514334333300857,11.606876093294462]
[null,null,"CO2",961.5691234210542,2317.0261879650534]
[null,null,"Total, gCO2e/bushel",{"$f":"D21*Fuel_Specs!$B$17+D22*Fuel_Specs!$B$18+D23*Fuel_Specs!$B$15+D24*Fuel_Specs!$B$16+D25","v":1029.9892169563952},{"$f":"E21*Fuel_Specs!$B$17+E22*Fuel_Specs!$B$18+E23*Fuel_Specs!$B$15+E24*Fuel_Specs!$B$16+E25","v":2760.2560682090811},{"$f":"F21*Fuel_Specs!$B$17+F22*Fuel_Specs!$B$18+F23*Fuel_Specs!$B$15+F24*Fuel_Specs!$B$16+F25","v":3458.8490758017497},{"$f":"SUM(D26:F26)","v":7249.0943609672258}]
[]
[]
[null,null,"Corn Transport","MDT Truck - Farm to Stack","HDDT","Rail"]
[null,null,"gCO2e/bushel-mile",17.253246445439522,4.3082012069138749,0.76381095330066706]
{"$rows_left_out":50}
{"sheet":"Fuel_Specs","index":3,"n_rows":48,"n_cols":9,"rows_kept":48,"cut":false,"hidden":false,"merged":[[2,1,2,2]]}
[]
["1) Specifications of Fuels"]
[null,"Heating Value",null,"Density","C ratio","S ratio","S ratio"]
[null,"LHV","HHV",null,"(% by wt)","(ppm by wt)","Actual ratio by wt","LHV/HHV","Energy Density"]
["Liquid Fuels:","BTU/gal","BTU/gal","grams/gal",null,null,null,null,"MJ/gal"]
["Gasoline blendstock",116090,124340,2819,0.86299999999999999,null,null,null,122.48143362649999]
["CARBOB",113300,121351.72710827805,2767,0.85899999999999999,null,null,null,119.53782780499999]
["Ethanol",76330,84530,2988,0.52200000000000002,0,0,0.90299302022950434,80.532413030499995]
["Gaseous Fuels (at 60F and 1atm):","BTU/ft3","BTU/ft3","grams/ft3",null,null,null,"LHV/HHV","MJ/unit"]
["Natural gas",930,1030,20.8,0.72399999999999998,6,6.0000000000000002E-6,{"$f":"B10/C10","v":0.90291262135922334},0.98]
["Pure Methane",910,1010,19.2,null,null,null,{"$f":"B11/C11","v":0.90099009900990101}]
[]
["2) Global Warming Potentials of Greenhouse Gases: relative to CO2"]
["CO2",1]
["CH4",25]
["N2O",298]
["VOC",3.1166666666666667]
["CO",1.5714285714285714]
["NO2",0]
[]
[]
["3) Unit Conversion"]
["Mass","1 g","1 kg","1 metric ton","1 lb","1 short ton"]
["g",1,1000,1000000,453.59237000000002,907184.74]
["kg",1E-3,1,1000,0.45359237000000002,907.18474000000003]
["metric ton",9.9999999999999995E-7,1E-3,1,4.5359237000000004E-4,0.90718474000000004]
["lb",2.2046226218487759E-3,2.2046226218487757,2204.6226218487759,1,2000]
["short ton",1.102311310924388E-6,1.1023113109243879E-3,1.1023113109243878,5.0000000000000001E-4,1]
[]
["Volume","1 m3","1 ml","1 L","1 gal","1 ft3"]
{"$rows_left_out":18}