{"text_format":"1","workbook":"xlsx","n_sheets":10,"sheets":["Basic Data","Sample Data","Local Limits","POTW Limits","Non-Conservative","Conventional Poll Tool","Toxic-Explosive Limits","Function","WA-OSHA-STDS","RREL Henry's Law Constants"],"not_rendered":{"charts":3,"images":0,"macros":1,"external_links":0,"defined_names":43,"comments":1,"pivot_tables":0},"unopened":[{"sheet":"Function","index":7,"reason":"part_missing"}],"bounds":{"document_bytes":16777216,"sheet_cells":100000,"rows_first":2000,"rows_last":500,"rows_between":2000,"halvings":0,"cell_chars":16384,"cell_head_chars":4096},"cells_cut":0,"cells_raw":0,"read":"whole","date_system":"1900"}

{"sheet":"Basic Data","index":0,"n_rows":74,"n_cols":21,"rows_kept":74,"cut":false,"hidden":false,"merged":[[27,3,27,15],[28,3,28,15],[2,1,2,2],[3,1,3,2],[4,1,4,2],[13,3,13,15],[18,3,18,15],[19,3,19,15],[23,3,26,15],[6,1,6,18],[7,1,7,18],[30,3,30,15],[29,3,29,15],[37,3,37,15],[38,3,38,15],[39,3,39,15],[34,3,34,15],[35,3,35,15],[36,3,36,15],[31,3,31,15]]}
[]
[null,"OVERVIEW OF METHODOLOGY:"]
[1,"Review Local Limits policy, spreadsheet instructions, & coordinate plan w/ Ecology"]
[2,"Enter the basic information on this sheet in this color cell",null,"<- And Click on Checkboxes to select Pollutants for Analysis"]
[3,"Enter Monitoring Data (inf, primary eff, final eff & sludge) in \"Sample Data\" ",null,"<- Data should be this color cell"]
[4,"Enter ave ambient & industrial pollutant levels in \"Sample Data\" rows 9&10",null,"<- The spreadsheet DOES NOT average ambient and industrial concentrations for you"]
[5,"Review the information for each pollutant to ensure the data makes sense"]
[6,"Adjust the analysis methods in \"Local Limits\" to reflect pollutant specific decisions "]
[7,"Enter Data in the \"Conventional Poll Tool\" tab for BOD, TSS, and Ammonia (example)"]
[8,"Evaluate appropriate limits for toxic-explosive pollutants which may be discharged"]
[9,"Compile limits & send this spreadsheet, the proposed ordinance, & a cover letter to Ecology"]
[10,"Plan for collecting additional data to fill gaps and periodically confirm limits are protective"]
[]
[null,"Name of Facility:",null,"<--- For this color cells, input is optional"]
[null,"Point of Contact:"]
[null,"Person Entering Data:"]
[null,"Reviewer:"]
[null,"GENERAL INFORMATION:","(Data in colored cells below required)"]
[null,"Receiving Water Hardness (if fresh)",null,"<----- Number must be between 25 and 400"]
[null,"(M)arine, (F)resh, or (B)oth Discharges",null,"<-----  Enter only letters \"M\", \"F\", or \"B\""]
[null,"Sludge: Class A (A) or (C)eiling level",null,"<-----  Enter only letters \"A\" or \"C\""]
[null,"Plant: (A)ctivated sludge or (O)ther",null,"<-----  Enter only letters \"A\" or \"O\""]
[]
[null,"Total Plant Flow (in MGD)",null,"<-----  For flows typically the most critical situation (one that yields the lowest local limits) is the lowest flow month, but run several scenarios if there is any doubt.  Adopt the lowest limits."]
[null,"Domestic Flow (in MGD)"]
[null,"Industrial Flow (in MGD)"]
[null,"Infiltration/Inflow (by subtraction)"]
[null,"Acute Dilution Factor",null,"<-----  From NPDES Permit Fact Sheet"]
[null,"Chronic Dilution Factor",null,"<-----  From NPDES Permit Fact Sheet"]
[null,"Dilution Factor for Human Health Based WQ  ",null,"<-----  Enter Chronic DF if not otherwise determined"]
[null,"Digester Flow (in MGD)",null,{"$f":"C24*300/20000","v":0}]
[null,"Dry Sludge Production Rate (US Tons/day)",null,{"$f":"C24*300*8.34/2000","v":0}]
[]
[null,"Default Method for Calculating Limits","Customize as needed for specific pollutants at \"LOCLIMIT.XLS\" Rows 45-49 "]
[null,"Sampling Data Available (inf, eff, sludge) (Y/N)",null,"<--- \"Y\" if sampling data available, otherwise defaults presumed"]
[null,"Credit present loading of existing sources (Y/N)",null,"<-- reduce influent to domestic using \"loclimit.xls\" row 28"]
[null,"Adjust for receiving water pollution (Y/N)",null,"<-- requires receiving water data in \"loclimit.xls\" row 29"]
[null,"Use Observed Overall Removal Rate (Y/N)",null,"<-- Always say \"Y\" if good data available from the POTW"]
[null,"Use Observed Primary Removal Rate (Y/N)",null,"<-- If primary effluent sample data is obtained say \"Y\""]
[null,"Fraction of Loading Capacity held in reserve",null,"<-- Enter .1 for 10%, etc."]
[" "]
[null,"Which Conservative Pollutants to Limit? (Bold = Required by EPA)"]
[null,"Check (or Un-Check) for Each Pollutant","Develop Local Limit? (check for YES)"]
[44,"Antimony"]
[45,"Arsenic (T)"]
[46,"Arsenic (penta or +5)"]
[47,"Beryllium"]
[48,"Cadmium"]
[49,"Chromium(+6)"]
[50,"Chromium (T)"]
[51,"Copper"]
[52,"Cyanide"]
[53,"Lead"]
[54,"Mercury"]
[55,"Molybdenum"]
[56,"Nickel"]
[57,"Selenium"]
[58,"Silver"]
[59,"Thallium"]
[60,"TributylTin"]
[61,"Zinc"]
[62,"Add #1"]
[63,"Add #2"]
[64,"Add #3"]
[65,"Add #4"]
[]
[null,"RECAP of how loadings were set:","(Don't enter data in below section)","Sb","As","As5","Be","Cd","Cr6","Cu","Cu","CN","Pb","Hg","Mo","Ni","Se","Ag","Th","TBT","Zn"]
[null,"Domestic Level from Sampling","Data to right is returned ->>",{"$f":"'Local Limits'!B50","v":0},{"$f":"'Local Limits'!C50","v":0},{"$f":"'Local Limits'!D50","v":0},{"$f":"'Local Limits'!E50","v":0},{"$f":"'Local Limits'!F50","v":0},{"$f":"'Local Limits'!G50","v":0},{"$f":"'Local Limits'!H50","v":0},{"$f":"'Local Limits'!I50","v":0},{"$f":"'Local Limits'!J50","v":0},{"$f":"'Local Limits'!K50","v":0},{"$f":"'Local Limits'!L50","v":0},{"$f":"'Local Limits'!M50","v":0},{"$f":"'Local Limits'!N50","v":0},{"$f":"'Local Limits'!O50","v":0},{"$f":"'Local Limits'!P50","v":0},{"$f":"'Local Limits'!Q50","v":0},{"$f":"'Local Limits'!R50","v":0},{"$f":"'Local Limits'!S50","v":0}]
[null,"Compensate for Existing Sources","Data to right is returned ->>",{"$f":"'Local Limits'!B51","v":0},{"$f":"'Local Limits'!C51","v":0},{"$f":"'Local Limits'!D51","v":0},{"$f":"'Local Limits'!E51","v":0},{"$f":"'Local Limits'!F51","v":0},{"$f":"'Local Limits'!G51","v":0},{"$f":"'Local Limits'!H51","v":0},{"$f":"'Local Limits'!I51","v":0},{"$f":"'Local Limits'!J51","v":0},{"$f":"'Local Limits'!K51","v":0},{"$f":"'Local Limits'!L51","v":0},{"$f":"'Local Limits'!M51","v":0},{"$f":"'Local Limits'!N51","v":0},{"$f":"'Local Limits'!O51","v":0},{"$f":"'Local Limits'!P51","v":0},{"$f":"'Local Limits'!Q51","v":0},{"$f":"'Local Limits'!R51","v":0},{"$f":"'Local Limits'!S51","v":0}]
[null,"Adjust for background levels","Data to right is returned ->>",{"$f":"'Local Limits'!B52","v":0},{"$f":"'Local Limits'!C52","v":0},{"$f":"'Local Limits'!D52","v":0},{"$f":"'Local Limits'!E52","v":0},{"$f":"'Local Limits'!F52","v":0},{"$f":"'Local Limits'!G52","v":0},{"$f":"'Local Limits'!H52","v":0},{"$f":"'Local Limits'!I52","v":0},{"$f":"'Local Limits'!J52","v":0},{"$f":"'Local Limits'!K52","v":0},{"$f":"'Local Limits'!L52","v":0},{"$f":"'Local Limits'!M52","v":0},{"$f":"'Local Limits'!N52","v":0},{"$f":"'Local Limits'!O52","v":0},{"$f":"'Local Limits'!P52","v":0},{"$f":"'Local Limits'!Q52","v":0},{"$f":"'Local Limits'!R52","v":0},{"$f":"'Local Limits'!S52","v":0}]
[null,"Overall removal rate from sampling","Data to right is returned ->>",{"$f":"'Local Limits'!B53","v":0},{"$f":"'Local Limits'!C53","v":0},{"$f":"'Local Limits'!D53","v":0},{"$f":"'Local Limits'!E53","v":0},{"$f":"'Local Limits'!F53","v":0},{"$f":"'Local Limits'!G53","v":0},{"$f":"'Local Limits'!H53","v":0},{"$f":"'Local Limits'!I53","v":0},{"$f":"'Local Limits'!J53","v":0},{"$f":"'Local Limits'!K53","v":0},{"$f":"'Local Limits'!L53","v":0},{"$f":"'Local Limits'!M53","v":0},{"$f":"'Local Limits'!N53","v":0},{"$f":"'Local Limits'!O53","v":0},{"$f":"'Local Limits'!P53","v":0},{"$f":"'Local Limits'!Q53","v":0},{"$f":"'Local Limits'!R53","v":0},{"$f":"'Local Limits'!S53","v":0}]
[null,"Primary removal rate from sampling","Data to right is returned ->>",{"$f":"'Local Limits'!B54","v":0},{"$f":"'Local Limits'!C54","v":0},{"$f":"'Local Limits'!D54","v":0},{"$f":"'Local Limits'!E54","v":0},{"$f":"'Local Limits'!F54","v":0},{"$f":"'Local Limits'!G54","v":0},{"$f":"'Local Limits'!H54","v":0},{"$f":"'Local Limits'!I54","v":0},{"$f":"'Local Limits'!J54","v":0},{"$f":"'Local Limits'!K54","v":0},{"$f":"'Local Limits'!L54","v":0},{"$f":"'Local Limits'!M54","v":0},{"$f":"'Local Limits'!N54","v":0},{"$f":"'Local Limits'!O54","v":0},{"$f":"'Local Limits'!P54","v":0},{"$f":"'Local Limits'!Q54","v":0},{"$f":"'Local Limits'!R54","v":0},{"$f":"'Local Limits'!S54","v":0}]
[null,"(For Contributing Flows Method, manually change row 11 of LOCLIM.xls spreadsheet to reflect the flow for which the pollutant will be allocated)"]
[null,"This \"How to Allocate Loadings\" section is used to understand how limits were derived at a later date or by a reviewer."]

{"sheet":"Sample Data","index":1,"n_rows":210,"n_cols":24,"rows_kept":210,"cut":false,"hidden":false,"merged":[]}
["ENTER DATA FROM PLANT SAMPLING IN THIS SPREADSHEET"]
["SUMMARY DATA",null,{"$f":"$C$13","v":"Antimony"},{"$f":"$D$13","v":"Arsenic (T) "},{"$f":"$E$13","v":"Arsenic(+5)"},{"$f":"F13","v":"Beryllium"},{"$f":"$G$13","v":"Cadmium"},{"$f":"$H$13","v":"Chrome(+6)"},{"$f":"$I$13","v":"Chrome (T)"},{"$f":"$J$13","v":"Copper"},{"$f":"$K$13","v":"Cyanide"},{"$f":"$L$13","v":"Lead"},{"$f":"$M$13","v":"Mercury"},{"$f":"$N$13","v":"Molybdenum"},{"$f":"$O$13","v":"Nickel"},{"$f":"$P$13","v":"Selenium"},{"$f":"$Q$13","v":"Silver"},{"$f":"$R$13","v":"Thallium"},{"$f":"S$13","v":"Tributyl Tin"},"Zinc","Add #1","Add #2","Add #3","Add #4"]
["Ave. Influent Conc.",null,{"$f":"AVERAGE(C14,C24, C34, C44, C54, C64, C74, C84, C94, C104, C114, C124, C134, C144, C154, C164, C174, C184, C194, C204)","v":{"$error":"#DIV/0!"}},{"$f":"AVERAGE(D$14,D$24, D$34, D$44, D$54, D$64, D$74, D$84, D$94, D$104, D$114, D$124, D$134, D$144, D$154, D$164, D$174, D$184, D$194, D$204)","v":{"$error":"#DIV/0!"}},{"$f":"AVERAGE(E$14,E$24, E$34, E$44, E$54, E$64, E$74, E$84, E$94, E$104, E$114, E$124, E$134, E$144, E$154, E$164, E$174, E$184, E$194, E$204)","v":15},{"$f":"AVERAGE(F$14,F$24, F$34, F$44, F$54, F$64, F$74, F$84, F$94, F$104, F$114, F$124, F$134, F$144, F$154, F$164, F$174, F$184, F$194, F$204)","v":{"$error":"#DIV/0!"}},{"$f":"AVERAGE(G$14,G$24, G$34, G$44, G$54, G$64, G$74, G$84, G$94, G$104, G$114, G$124, G$134, G$144, G$154, G$164, G$174, G$184, G$194, G$204)","v":{"$error":"#DIV/0!"}},{"$f":"AVERAGE(H$14,H$24, H$34, H$44, H$54, H$64, H$74, H$84, H$94, H$104, H$114, H$124, H$134, H$144, H$154, H$164, H$174, H$184, H$194, H$204)","v":{"$error":"#DIV/0!"}},{"$f":"AVERAGE(I$14,I$24, I$34, I$44, I$54, I$64, I$74, I$84, I$94, I$104, I$114, I$124, I$134, I$144, I$154, I$164, I$174, I$184, I$194, I$204)","v":{"$error":"#DIV/0!"}},{"$error":"#DIV/0!"},{"$error":"#DIV/0!"},{"$error":"#DIV/0!"},{"$error":"#DIV/0!"},{"$error":"#DIV/0!"},{"$error":"#DIV/0!"},{"$f":"AVERAGE(P$14,P$24, P$34, P$44, P$54, P$64, P$74, P$84, P$94, P$104, P$114, P$124, P$134, P$144, P$154, P$164, P$174, P$184, P$194, P$204)","v":{"$error":"#DIV/0!"}},{"$error":"#DIV/0!"},{"$error":"#DIV/0!"},{"$error":"#DIV/0!"},{"$error":"#DIV/0!"},{"$error":"#DIV/0!"},{"$error":"#DIV/0!"},{"$error":"#DIV/0!"},{"$error":"#DIV/0!"}]
["Ave. Effluent Conc.",null,{"$f":"AVERAGE(C15,C25, C35, C45, C55, C65, C75, C85, C95, C105, C115, C125, C135, C145, C155, C165, C175, C185, C195, C205)","v":{"$error":"#DIV/0!"}},{"$f":"AVERAGE(D15,D25, D35, D45, D55, D65, D75, D85, D95, D105, D115, D125, D135, D145, D155, D165, D175, D185, D195, D205)","v":{"$error":"#DIV/0!"}},6,{"$error":"#DIV/0!"},{"$error":"#DIV/0!"},{"$error":"#DIV/0!"},{"$error":"#DIV/0!"},{"$f":"AVERAGE(J15,J25, J35, J45, J55, J65, J75, J85, J95, J105, J115, J125, J135, J145, J155, J165, J175, J185, J195, J205)","v":{"$error":"#DIV/0!"}},{"$error":"#DIV/0!"},{"$error":"#DIV/0!"},{"$error":"#DIV/0!"},{"$error":"#DIV/0!"},{"$error":"#DIV/0!"},{"$f":"AVERAGE(P15,P25, P35, P45, P55, P65, P75, P85, P95, P105, P115, P125, P135, P145, P155, P165, P175, P185, P195, P205)","v":{"$error":"#DIV/0!"}},{"$error":"#DIV/0!"},{"$error":"#DIV/0!"},{"$error":"#DIV/0!"},{"$error":"#DIV/0!"},{"$error":"#DIV/0!"},{"$error":"#DIV/0!"},{"$error":"#DIV/0!"},{"$error":"#DIV/0!"}]
["Ave. Primary Removal ",null,{"$f":"AVERAGE(C$19,C$29, C$39, C$49, C$59, C$69, C$79, C$89, C$99, C$109, C$119, C$129, C$139, C$149, C$159, C$169, C$179, C$189, C$199, C$209)","v":{"$error":"#DIV/0!"}},{"$f":"AVERAGE(D$19,D$29, D$39, D$49, D$59, D$69, D$79, D$89, D$99, D$109, D$119, D$129, D$139, D$149, D$159, D$169, D$179, D$189, D$199, D$209)","v":{"$error":"#DIV/0!"}},{"$f":"AVERAGE(E$19,E$29, E$39, E$49, E$59, E$69, E$79, E$89, E$99, E$109, E$119, E$129, E$139, E$149, E$159, E$169, E$179, E$189, E$199, E$209)","v":0.4},{"$error":"#DIV/0!"},{"$error":"#DIV/0!"},{"$error":"#DIV/0!"},{"$error":"#DIV/0!"},{"$error":"#DIV/0!"},{"$error":"#DIV/0!"},{"$error":"#DIV/0!"},{"$error":"#DIV/0!"},{"$f":"AVERAGE(N$19,N$29, N$39, N$49, N$59, N$69, N$79, N$89, N$99, N$109, N$119, N$129, N$139, N$149, N$159, N$169, N$179, N$189, N$199, N$209)","v":{"$error":"#DIV/0!"}},{"$f":"AVERAGE(O$19,O$29, O$39, O$49, O$59, O$69, O$79, O$89, O$99, O$109, O$119, O$129, O$139, O$149, O$159, O$169, O$179, O$189, O$199, O$209)","v":{"$error":"#DIV/0!"}},{"$f":"AVERAGE(P$19,P$29, P$39, P$49, P$59, P$69, P$79, P$89, P$99, P$109, P$119, P$129, P$139, P$149, P$159, P$169, P$179, P$189, P$199, P$209)","v":{"$error":"#DIV/0!"}},{"$f":"AVERAGE(Q$19,Q$29, Q$39, Q$49, Q$59, Q$69, Q$79, Q$89, Q$99, Q$109, Q$119, Q$129, Q$139, Q$149, Q$159, Q$169, Q$179, Q$189, Q$199, Q$209)","v":{"$error":"#DIV/0!"}},{"$f":"AVERAGE(R$19,R$29, R$39, R$49, R$59, R$69, R$79, R$89, R$99, R$109, R$119, R$129, R$139, R$149, R$159, R$169, R$179, R$189, R$199, R$209)","v":{"$error":"#DIV/0!"}},{"$f":"AVERAGE(S$19,S$29, S$39, S$49, S$59, S$69, S$79, S$89, S$99, S$109, S$119, S$129, S$139, S$149, S$159, S$169, S$179, S$189, S$199, S$209)","v":{"$error":"#DIV/0!"}},{"$error":"#DIV/0!"},{"$error":"#DIV/0!"},{"$error":"#DIV/0!"},{"$error":"#DIV/0!"},{"$error":"#DIV/0!"}]
["Ave. Overall Removal",null,{"$f":" AVERAGE(C$20,C$30, C$40, C$50, C$60, C$70, C$80, C$90, C$100, C$110, C$120, C$130, C$140, C$150, C$160, C$170, C$180, C$190, C$200, C$210)","v":{"$error":"#DIV/0!"}},{"$error":"#DIV/0!"},0.6,{"$error":"#DIV/0!"},{"$error":"#DIV/0!"},{"$error":"#DIV/0!"},{"$error":"#DIV/0!"},{"$error":"#DIV/0!"},{"$error":"#DIV/0!"},{"$error":"#DIV/0!"},{"$error":"#DIV/0!"},{"$error":"#DIV/0!"},{"$error":"#DIV/0!"},{"$error":"#DIV/0!"},{"$f":" AVERAGE(Q$20,Q$30, Q$40, Q$50, Q$60, Q$70, Q$80, Q$90, Q$100, Q$110, Q$120, Q$130, Q$140, Q$150, Q$160, Q$170, Q$180, Q$190, Q$200, Q$210)","v":{"$error":"#DIV/0!"}},{"$error":"#DIV/0!"},{"$error":"#DIV/0!"},{"$error":"#DIV/0!"},{"$error":"#DIV/0!"},{"$error":"#DIV/0!"},{"$error":"#DIV/0!"},{"$error":"#DIV/0!"}]
["Effluent Variation (COV)",null,{"$f":"STDEV(C15,C25,C35,C45,C55,C65,C75,C85,C95,C105,C115,C125,C135,C145,C155,C165,C175,C185,C195,C205)/GEOMEAN(C15,C25,C35,C45,C55,C65,C75,C85,C95,C105,C115,C125,C135,C145,C155,C165,C175,C185,C195,C205)","v":{"$error":"#DIV/0!"}},{"$f":"STDEV(D15,D25,D35,D45,D55,D65,D75,D85,D95,D105,D115,D125,D135,D145,D155,D165,D175,D185,D195,D205)/GEOMEAN(D15,D25,D35,D45,D55,D65,D75,D85,D95,D105,D115,D125,D135,D145,D155,D165,D175,D185,D195,D205)","v":{"$error":"#DIV/0!"}},{"$error":"#DIV/0!"},{"$error":"#DIV/0!"},{"$error":"#DIV/0!"},{"$error":"#DIV/0!"},{"$error":"#DIV/0!"},{"$error":"#DIV/0!"},{"$error":"#DIV/0!"},{"$error":"#DIV/0!"},{"$error":"#DIV/0!"},{"$error":"#DIV/0!"},{"$error":"#DIV/0!"},{"$f":"STDEV(P15,P25,P35,P45,P55,P65,P75,P85,P95,P105,P115,P125,P135,P145,P155,P165,P175,P185,P195,P205)/GEOMEAN(P15,P25,P35,P45,P55,P65,P75,P85,P95,P105,P115,P125,P135,P145,P155,P165,P175,P185,P195,P205)","v":{"$error":"#DIV/0!"}},{"$error":"#DIV/0!"},{"$error":"#DIV/0!"},{"$error":"#DIV/0!"},{"$error":"#DIV/0!"},{"$error":"#DIV/0!"},{"$error":"#DIV/0!"},{"$error":"#DIV/0!"},{"$error":"#DIV/0!"}]
["Average Sludge Conc.",null,{"$f":"AVERAGE(C17,C27,C37,C47,C57,C67,C77,C87,C97,C107,C117,C127,C137,C147,C157,C167,C177,C187,C197,C207)","v":{"$error":"#DIV/0!"}},{"$f":"AVERAGE(D17,D27,D37,D47,D57,D67,D77,D87,D97,D107,D117,D127,D137,D147,D157,D167,D177,D187,D197,D207)","v":{"$error":"#DIV/0!"}},18,{"$error":"#DIV/0!"},{"$error":"#DIV/0!"},{"$error":"#DIV/0!"},{"$error":"#DIV/0!"},{"$error":"#DIV/0!"},{"$error":"#DIV/0!"},{"$error":"#DIV/0!"},{"$error":"#DIV/0!"},{"$error":"#DIV/0!"},{"$error":"#DIV/0!"},{"$f":"AVERAGE(P17,P27,P37,P47,P57,P67,P77,P87,P97,P107,P117,P127,P137,P147,P157,P167,P177,P187,P197,P207)","v":{"$error":"#DIV/0!"}},{"$error":"#DIV/0!"},{"$error":"#DIV/0!"},{"$error":"#DIV/0!"},{"$error":"#DIV/0!"},{"$error":"#DIV/0!"},{"$error":"#DIV/0!"},{"$error":"#DIV/0!"},{"$error":"#DIV/0!"}]
["Ambient Receiving Water Conc.",null,null,null,0.12]
["AVE Industrial Conc."]
["SUMMARY (ABOVE)",null,"Click the \"+\" button to the left of row numbers to review or input data."]
["SAMPLE 1",null,"Enter only dates and sampling results (white boxes in default pallate)",null,null,null,null,null,null,null,null,null,null," "]
["Date:","LOCATION","Antimony","Arsenic (T) ","Arsenic(+5)","Beryllium","Cadmium","Chrome(+6)","Chrome (T)","Copper","Cyanide","Lead","Mercury","Molybdenum","Nickel","Selenium","Silver","Thallium","Tributyl Tin","Zinc",{"$f":"'Basic Data'!B62","v":"Add #1"},{"$f":"'Basic Data'!B63","v":"Add #2"},{"$f":"'Basic Data'!B64","v":"Add #3"},{"$f":"'Basic Data'!B65","v":"Add #4"}]
["2010-01-13","Influent",null,null,15]
[null,"Effluent",null,null,6]
[null,"Prim._Clar.",null,null,9]
[null,"Sludge",null,null,18]
[null,"Detection_Limit",null,null,0]
["Primary Removal Rate:",null,{"$f":"IF(AND(C14>C18, C14>C15, C14>=C16, C16>0), ((C14-C16)/C14), \"Can't Do\")","v":"Can't Do"},{"$f":"IF(AND(D14>D18, D14>D15, D14>=D16, D16>0), ((D14-D16)/D14), \"Can't Do\")","v":"Can't Do"},0.4,"Can't Do","Can't Do","Can't Do","Can't Do","Can't Do","Can't Do","Can't Do","Can't Do","Can't Do","Can't Do","Can't Do","Can't Do","Can't Do","Can't Do","Can't Do","Can't Do","Can't Do","Can't Do","Can't Do"]
["Overall Removal Rate",null,{"$f":"IF(C14>C15, ((C14-C15)/C14), \"Can't Do\")","v":"Can't Do"},"Can't Do",0.6,"Can't Do","Can't Do","Can't Do","Can't Do","Can't Do","Can't Do","Can't Do","Can't Do","Can't Do","Can't Do",{"$f":"IF(P14>P15, ((P14-P15)/P14), \"Can't Do\")","v":"Can't Do"},"Can't Do","Can't Do","Can't Do","Can't Do","Can't Do","Can't Do","Can't Do","Can't Do"]
[" ",null,{"$f":"'Basic Data'!$C$32","v":0}," "]
["SAMPLE 2",null,"Enter only dates and sampling results (white boxes in default pallate)",null,null,null,null,null,null,null,null,null,null," "]
["Date:","LOCATION",{"$f":"C13","v":"Antimony"},{"$f":"D13","v":"Arsenic (T) "},"Arsenic(+5)","Beryllium","Cadmium","Chrome(+6)","Chrome (T)","Copper","Cyanide","Lead","Mercury","Molybdenum","Nickel","Selenium","Silver","Thallium","Tributyl Tin","Zinc","Add #1","Add #2","Add #3","Add #4"]
[null,"Influent"]
[null,"Effluent"]
[null,"Prim._Clar."]
[null,"Sludge"]
[null,"Detection_Limit",0,0,0,0,0,0,0,0,0,0,0,0,0,0,0,0,0,0,0,0,0,0]
["Primary Removal Rate:",null,{"$f":"IF(AND(C24>C28, C24>C25, C24>C26, C26>0), ((C24-C26)/C24), \"Can't Do\")","v":"Can't Do"},{"$f":"IF(AND(D24>D28, D24>D25, D24>D26, D26>0), ((D24-D26)/D24), \"Can't Do\")","v":"Can't Do"},{"$f":"IF(AND(E24>E28, E24>E25, E24>E26, E26>0), ((E24-E26)/E24), \"Can't Do\")","v":"Can't Do"},"Can't Do","Can't Do","Can't Do","Can't Do","Can't Do","Can't Do","Can't Do","Can't Do","Can't Do","Can't Do",{"$f":"IF(AND(P24>P28, P24>P25, P24>P26, P26>0), ((P24-P26)/P24), \"Can't Do\")","v":"Can't Do"},{"$f":"IF(AND(Q24>Q28, Q24>Q25, Q24>Q26, Q26>0), ((Q24-Q26)/Q24), \"Can't Do\")","v":"Can't Do"},"Can't Do","Can't Do","Can't Do","Can't Do","Can't Do","Can't Do","Can't Do"]
["Overall Removal Rate",null,{"$f":"IF(C24>C25, ((C24-C25)/C24), \"Can't Do\")","v":"Can't Do"},"Can't Do","Can't Do","Can't Do","Can't Do","Can't Do","Can't Do","Can't Do","Can't Do","Can't Do","Can't Do","Can't Do","Can't Do",{"$f":"IF(P24>P25, ((P24-P25)/P24), \"Can't Do\")","v":"Can't Do"},{"$f":"IF(Q24>Q25, ((Q24-Q25)/Q24), \"Can't Do\")","v":"Can't Do"},"Can't Do","Can't Do","Can't Do","Can't Do","Can't Do","Can't Do","Can't Do"]
[null,null," "," "]
["SAMPLE 3",null,"Enter only dates and sampling results (white boxes in default pallate)",null,null,null,null,null,null,null,null,null,null," "]
["Date:","LOCATION",{"$f":"C13","v":"Antimony"},{"$f":"D13","v":"Arsenic (T) "},"Arsenic(+5)","Beryllium","Cadmium","Chrome(+6)","Chrome (T)","Copper","Cyanide","Lead","Mercury","Molybdenum","Nickel","Selenium","Silver","Thallium","Tributyl Tin","Zinc","Add #1","Add #2","Add #3","Add #4"]
[null,"Influent"]
[null,"Effluent"]
[null,"Prim._Clar."]
[null,"Sludge"]
[null,"Detection_Limit",0,0,0,0,0,0,0,0,0,0,0,0,0,0,0,0,0,0,0,0,0,0]
["Primary Removal Rate:",null,{"$f":"IF(AND(C34>C38, C34>C35, C34>C36, C36>0), ((C34-C36)/C34), \"Can't Do\")","v":"Can't Do"},{"$f":"IF(AND(D34>D38, D34>D35, D34>D36, D36>0), ((D34-D36)/D34), \"Can't Do\")","v":"Can't Do"},"Can't Do","Can't Do","Can't Do","Can't Do","Can't Do","Can't Do","Can't Do","Can't Do","Can't Do","Can't Do","Can't Do",{"$f":"IF(AND(P34>P38, P34>P35, P34>P36, P36>0), ((P34-P36)/P34), \"Can't Do\")","v":"Can't Do"},{"$f":"IF(AND(Q34>Q38, Q34>Q35, Q34>Q36, Q36>0), ((Q34-Q36)/Q34), \"Can't Do\")","v":"Can't Do"},"Can't Do","Can't Do","Can't Do","Can't Do","Can't Do","Can't Do","Can't Do"]
["Overall Removal Rate",null,{"$f":"IF(C34>C35, ((C34-C35)/C34), \"Can't Do\")","v":"Can't Do"},"Can't Do","Can't Do","Can't Do","Can't Do","Can't Do","Can't Do","Can't Do","Can't Do","Can't Do","Can't Do","Can't Do","Can't Do",{"$f":"IF(P34>P35, ((P34-P35)/P34), \"Can't Do\")","v":"Can't Do"},{"$f":"IF(Q34>Q35, ((Q34-Q35)/Q34), \"Can't Do\")","v":"Can't Do"},"Can't Do","Can't Do","Can't Do","Can't Do","Can't Do","Can't Do","Can't Do"]
[]
["SAMPLE 4",null,"Enter only dates and sampling results (white boxes in default pallate)",null,null,null,null,null,null,null,null,null,null," "]
["Date:","LOCATION",{"$f":"C13","v":"Antimony"},{"$f":"D13","v":"Arsenic (T) "},"Arsenic(+5)","Beryllium","Cadmium","Chrome(+6)","Chrome (T)","Copper","Cyanide","Lead","Mercury","Molybdenum","Nickel","Selenium","Silver","Thallium","Tributyl Tin","Zinc","Add #1","Add #2","Add #3","Add #4"]
[null,"Influent"]
[null,"Effluent"]
[null,"Prim._Clar."]
[null,"Sludge"]
[null,"Detection_Limit",0,0,0,0,0,0,0,0,0,0,0,0,0,0,0,0,0,0,0,0,0,0]
["Primary Removal Rate:",null,{"$f":"IF(AND(C44>C48, C44>C45, C44>C46, C46>0), ((C44-C46)/C44), \"Can't Do\")","v":"Can't Do"},{"$f":"IF(AND(D44>D48, D44>D45, D44>D46, D46>0), ((D44-D46)/D44), \"Can't Do\")","v":"Can't Do"},"Can't Do","Can't Do","Can't Do","Can't Do","Can't Do","Can't Do","Can't Do","Can't Do","Can't Do","Can't Do","Can't Do",{"$f":"IF(AND(P44>P48, P44>P45, P44>P46, P46>0), ((P44-P46)/P44), \"Can't Do\")","v":"Can't Do"},{"$f":"IF(AND(Q44>Q48, Q44>Q45, Q44>Q46, Q46>0), ((Q44-Q46)/Q44), \"Can't Do\")","v":"Can't Do"},"Can't Do","Can't Do","Can't Do","Can't Do","Can't Do","Can't Do","Can't Do"]
["Overall Removal Rate",null,{"$f":"IF(C44>C45, ((C44-C45)/C44), \"Can't Do\")","v":"Can't Do"},"Can't Do","Can't Do","Can't Do","Can't Do","Can't Do","Can't Do","Can't Do","Can't Do","Can't Do","Can't Do","Can't Do","Can't Do",{"$f":"IF(P44>P45, ((P44-P45)/P44), \"Can't Do\")","v":"Can't Do"},{"$f":"IF(Q44>Q45, ((Q44-Q45)/Q44), \"Can't Do\")","v":"Can't Do"},"Can't Do","Can't Do","Can't Do","Can't Do","Can't Do","Can't Do","Can't Do"]
[]
["SAMPLE 5",null,"Enter only dates and sampling results (white boxes in default pallate)",null,null,null,null,null,null,null,null,null,null," "]
["Date:","LOCATION",{"$f":"C13","v":"Antimony"},{"$f":"D13","v":"Arsenic (T) "},"Arsenic(+5)","Beryllium","Cadmium","Chrome(+6)","Chrome (T)","Copper","Cyanide","Lead","Mercury","Molybdenum","Nickel","Selenium","Silver","Thallium","Tributyl Tin","Zinc","Add #1","Add #2","Add #3","Add #4"]
[null,"Influent"]
[null,"Effluent"]
[null,"Prim._Clar."]
[null,"Sludge"]
[null,"Detection_Limit",0,0,0,0,0,0,0,0,0,0,0,0,0,0,0,0,0,0,0,0,0,0]
["Primary Removal Rate:",null,{"$f":"IF(AND(C54>C58, C54>C55, C54>C56, C56>0), ((C54-C56)/C54), \"Can't Do\")","v":"Can't Do"},{"$f":"IF(AND(D54>D58, D54>D55, D54>D56, D56>0), ((D54-D56)/D54), \"Can't Do\")","v":"Can't Do"},"Can't Do","Can't Do","Can't Do","Can't Do","Can't Do","Can't Do","Can't Do","Can't Do","Can't Do","Can't Do","Can't Do",{"$f":"IF(AND(P54>P58, P54>P55, P54>P56, P56>0), ((P54-P56)/P54), \"Can't Do\")","v":"Can't Do"},{"$f":"IF(AND(Q54>Q58, Q54>Q55, Q54>Q56, Q56>0), ((Q54-Q56)/Q54), \"Can't Do\")","v":"Can't Do"},"Can't Do","Can't Do","Can't Do","Can't Do","Can't Do","Can't Do","Can't Do"]
["Overall Removal Rate",null,{"$f":"IF(C54>C55, ((C54-C55)/C54), \"Can't Do\")","v":"Can't Do"},"Can't Do","Can't Do","Can't Do","Can't Do","Can't Do","Can't Do","Can't Do","Can't Do","Can't Do","Can't Do","Can't Do","Can't Do",{"$f":"IF(P54>P55, ((P54-P55)/P54), \"Can't Do\")","v":"Can't Do"},{"$f":"IF(Q54>Q55, ((Q54-Q55)/Q54), \"Can't Do\")","v":"Can't Do"},"Can't Do","Can't Do","Can't Do","Can't Do","Can't Do","Can't Do","Can't Do"]
[]
["SAMPLE 6",null,"Enter only dates and sampling results (white boxes in default pallate)",null,null,null,null,null,null,null,null,null,null," "]
["Date:","LOCATION",{"$f":"C13","v":"Antimony"},{"$f":"D13","v":"Arsenic (T) "},"Arsenic(+5)","Beryllium","Cadmium","Chrome(+6)","Chrome (T)","Copper","Cyanide","Lead","Mercury","Molybdenum","Nickel","Selenium","Silver","Thallium","Tributyl Tin","Zinc","Add #1","Add #2","Add #3","Add #4"]
[null,"Influent"]
[null,"Effluent"]
[null,"Prim._Clar."]
[null,"Sludge"]
[null,"Detection_Limit",0,0,0,0,0,0,0,0,0,0,0,0,0,0,0,0,0,0,0,0,0,0]
["Primary Removal Rate:",null,{"$f":"IF(AND(C64>C68, C64>C65, C64>C66, C66>0), ((C64-C66)/C64), \"Can't Do\")","v":"Can't Do"},"Can't Do","Can't Do","Can't Do","Can't Do","Can't Do","Can't Do","Can't Do","Can't Do","Can't Do","Can't Do","Can't Do","Can't Do",{"$f":"IF(AND(P64>P68, P64>P65, P64>P66, P66>0), ((P64-P66)/P64), \"Can't Do\")","v":"Can't Do"},{"$f":"IF(AND(Q64>Q68, Q64>Q65, Q64>Q66, Q66>0), ((Q64-Q66)/Q64), \"Can't Do\")","v":"Can't Do"},"Can't Do","Can't Do","Can't Do","Can't Do","Can't Do","Can't Do","Can't Do"]
["Overall Removal Rate",null,{"$f":"IF(C64>C65, ((C64-C65)/C64), \"Can't Do\")","v":"Can't Do"},"Can't Do","Can't Do","Can't Do","Can't Do","Can't Do","Can't Do","Can't Do","Can't Do","Can't Do","Can't Do","Can't Do","Can't Do",{"$f":"IF(P64>P65, ((P64-P65)/P64), \"Can't Do\")","v":"Can't Do"},{"$f":"IF(Q64>Q65, ((Q64-Q65)/Q64), \"Can't Do\")","v":"Can't Do"},"Can't Do","Can't Do","Can't Do","Can't Do","Can't Do","Can't Do","Can't Do"]
[null,null," "]
["SAMPLE 7",null,"Enter only dates and sampling results (white boxes in default pallate)",null,null,null,null,null,null,null,null,null,null," "]
["Date:","LOCATION",{"$f":"C13","v":"Antimony"},{"$f":"D13","v":"Arsenic (T) "},"Arsenic(+5)","Beryllium","Cadmium","Chrome(+6)","Chrome (T)","Copper","Cyanide","Lead","Mercury","Molybdenum","Nickel","Selenium","Silver","Thallium","Tributyl Tin","Zinc","Add #1","Add #2","Add #3","Add #4"]
[null,"Influent"]
[null,"Effluent"]
[null,"Prim._Clar."]
[null,"Sludge"]
[null,"Detection_Limit",0,0,0,0,0,0,0,0,0,0,0,0,0,0,0,0,0,0,0,0,0,0]
["Primary Removal Rate:",null,{"$f":"IF(AND(C74>C78, C74>C75, C74>C76, C76>0), ((C74-C76)/C74), \"Can't Do\")","v":"Can't Do"},{"$f":"IF(AND(D74>D78, D74>D75, D74>D76, D76>0), ((D74-D76)/D74), \"Can't Do\")","v":"Can't Do"},"Can't Do","Can't Do","Can't Do","Can't Do","Can't Do","Can't Do","Can't Do","Can't Do","Can't Do","Can't Do","Can't Do",{"$f":"IF(AND(P74>P78, P74>P75, P74>P76, P76>0), ((P74-P76)/P74), \"Can't Do\")","v":"Can't Do"},{"$f":"IF(AND(Q74>Q78, Q74>Q75, Q74>Q76, Q76>0), ((Q74-Q76)/Q74), \"Can't Do\")","v":"Can't Do"},"Can't Do","Can't Do","Can't Do","Can't Do","Can't Do","Can't Do","Can't Do"]
["Overall Removal Rate",null,{"$f":"IF(C74>C75, ((C74-C75)/C74), \"Can't Do\")","v":"Can't Do"},"Can't Do","Can't Do","Can't Do","Can't Do","Can't Do","Can't Do","Can't Do","Can't Do","Can't Do","Can't Do","Can't Do","Can't Do",{"$f":"IF(P74>P75, ((P74-P75)/P74), \"Can't Do\")","v":"Can't Do"},{"$f":"IF(Q74>Q75, ((Q74-Q75)/Q74), \"Can't Do\")","v":"Can't Do"},"Can't Do","Can't Do","Can't Do","Can't Do","Can't Do","Can't Do","Can't Do"]
[]
["SAMPLE 8",null,"Enter only dates and sampling results (white boxes in default pallate)",null,null,null,null,null,null,null,null,null,null," "]
["Date:","LOCATION",{"$f":"C13","v":"Antimony"},{"$f":"D13","v":"Arsenic (T) "},"Arsenic(+5)","Beryllium","Cadmium","Chrome(+6)","Chrome (T)","Copper","Cyanide","Lead","Mercury","Molybdenum","Nickel","Selenium","Silver","Thallium","Tributyl Tin","Zinc","Add #1","Add #2","Add #3","Add #4"]
[null,"Influent"]
[null,"Effluent"]
[null,"Prim._Clar."]
[null,"Sludge"]
[null,"Detection_Limit",0,0,0,0,0,0,0,0,0,0,0,0,0,0,0,0,0,0,0,0,0,0]
["Primary Removal Rate:",null,{"$f":"IF(AND(C84>C88, C84>C85, C84>C86, C86>0), ((C84-C86)/C84), \"Can't Do\")","v":"Can't Do"},{"$f":"IF(AND(D84>D88, D84>D85, D84>D86, D86>0), ((D84-D86)/D84), \"Can't Do\")","v":"Can't Do"},"Can't Do","Can't Do","Can't Do","Can't Do","Can't Do","Can't Do","Can't Do","Can't Do","Can't Do","Can't Do","Can't Do",{"$f":"IF(AND(P84>P88, P84>P85, P84>P86, P86>0), ((P84-P86)/P84), \"Can't Do\")","v":"Can't Do"},{"$f":"IF(AND(Q84>Q88, Q84>Q85, Q84>Q86, Q86>0), ((Q84-Q86)/Q84), \"Can't Do\")","v":"Can't Do"},"Can't Do","Can't Do","Can't Do","Can't Do","Can't Do","Can't Do","Can't Do"]
["Overall Removal Rate",null,{"$f":"IF(C84>C85, ((C84-C85)/C84), \"Can't Do\")","v":"Can't Do"},"Can't Do","Can't Do","Can't Do","Can't Do","Can't Do","Can't Do","Can't Do","Can't Do","Can't Do","Can't Do","Can't Do","Can't Do",{"$f":"IF(P84>P85, ((P84-P85)/P84), \"Can't Do\")","v":"Can't Do"},{"$f":"IF(Q84>Q85, ((Q84-Q85)/Q84), \"Can't Do\")","v":"Can't Do"},"Can't Do","Can't Do","Can't Do","Can't Do","Can't Do","Can't Do","Can't Do"]
[]
["SAMPLE 9",null,"Enter only dates and sampling results (white boxes in default pallate)",null,null,null,null,null,null,null,null,null,null," "]
["Date:","LOCATION",{"$f":"C13","v":"Antimony"},{"$f":"D13","v":"Arsenic (T) "},"Arsenic(+5)","Beryllium","Cadmium","Chrome(+6)","Chrome (T)","Copper","Cyanide","Lead","Mercury","Molybdenum","Nickel","Selenium","Silver","Thallium","Tributyl Tin","Zinc","Add #1","Add #2","Add #3","Add #4"]
[null,"Influent"]
[null,"Effluent"]
[null,"Prim._Clar."]
[null,"Sludge"]
[null,"Detection_Limit",0,0,0,0,0,0,0,0,0,0,0,0,0,0,0,0,0,0,0,0,0,0]
["Primary Removal Rate:",null,{"$f":"IF(AND(C94>C98, C94>C95, C94>C96, C96>0), ((C94-C96)/C94), \"Can't Do\")","v":"Can't Do"},{"$f":"IF(AND(D94>D98, D94>D95, D94>D96, D96>0), ((D94-D96)/D94), \"Can't Do\")","v":"Can't Do"},"Can't Do","Can't Do","Can't Do","Can't Do","Can't Do","Can't Do","Can't Do","Can't Do","Can't Do","Can't Do","Can't Do",{"$f":"IF(AND(P94>P98, P94>P95, P94>P96, P96>0), ((P94-P96)/P94), \"Can't Do\")","v":"Can't Do"},{"$f":"IF(AND(Q94>Q98, Q94>Q95, Q94>Q96, Q96>0), ((Q94-Q96)/Q94), \"Can't Do\")","v":"Can't Do"},"Can't Do","Can't Do","Can't Do","Can't Do","Can't Do","Can't Do","Can't Do"]
["Overall Removal Rate",null,{"$f":"IF(C94>C95, ((C94-C95)/C94), \"Can't Do\")","v":"Can't Do"},"Can't Do","Can't Do","Can't Do","Can't Do","Can't Do","Can't Do","Can't Do","Can't Do","Can't Do","Can't Do","Can't Do","Can't Do",{"$f":"IF(P94>P95, ((P94-P95)/P94), \"Can't Do\")","v":"Can't Do"},{"$f":"IF(Q94>Q95, ((Q94-Q95)/Q94), \"Can't Do\")","v":"Can't Do"},"Can't Do","Can't Do","Can't Do","Can't Do","Can't Do","Can't Do","Can't Do"]
[]
["SAMPLE 10",null,"Enter only dates and sampling results (white boxes in default pallate)",null,null,null,null,null,null,null,null,null,null," "]
["Date:","LOCATION",{"$f":"C13","v":"Antimony"},{"$f":"D13","v":"Arsenic (T) "},"Arsenic(+5)","Beryllium","Cadmium","Chrome(+6)","Chrome (T)","Copper","Cyanide","Lead","Mercury","Molybdenum","Nickel","Selenium","Silver","Thallium","Tributyl Tin","Zinc","Add #1","Add #2","Add #3","Add #4"]
[null,"Influent"]
[null,"Effluent"]
[null,"Prim._Clar."]
[null,"Sludge"]
[null,"Detection_Limit",0,0,0,0,0,0,0,0,0,0,0,0,0,0,0,0,0,0,0,0,0,0]
["Primary Removal Rate:",null,{"$f":"IF(AND(C104>C108, C104>C105, C104>C106, C106>0), ((C104-C106)/C104), \"Can't Do\")","v":"Can't Do"},{"$f":"IF(AND(D104>D108, D104>D105, D104>D106, D106>0), ((D104-D106)/D104), \"Can't Do\")","v":"Can't Do"},"Can't Do","Can't Do","Can't Do","Can't Do","Can't Do","Can't Do","Can't Do","Can't Do","Can't Do","Can't Do","Can't Do",{"$f":"IF(AND(P104>P108, P104>P105, P104>P106, P106>0), ((P104-P106)/P104), \"Can't Do\")","v":"Can't Do"},{"$f":"IF(AND(Q104>Q108, Q104>Q105, Q104>Q106, Q106>0), ((Q104-Q106)/Q104), \"Can't Do\")","v":"Can't Do"},"Can't Do","Can't Do","Can't Do","Can't Do","Can't Do","Can't Do","Can't Do"]
["Overall Removal Rate",null,{"$f":"IF(C104>C105, ((C104-C105)/C104), \"Can't Do\")","v":"Can't Do"},"Can't Do","Can't Do","Can't Do","Can't Do","Can't Do","Can't Do","Can't Do","Can't Do","Can't Do","Can't Do","Can't Do","Can't Do",{"$f":"IF(P104>P105, ((P104-P105)/P104), \"Can't Do\")","v":"Can't Do"},{"$f":"IF(Q104>Q105, ((Q104-Q105)/Q104), \"Can't Do\")","v":"Can't Do"},"Can't Do","Can't Do","Can't Do","Can't Do","Can't Do","Can't Do","Can't Do"]
[]
["SAMPLE 11",null,"Enter only dates and sampling results (white boxes in default pallate)",null,null,null,null,null,null,null,null,null,null," "]
["Date:","LOCATION",{"$f":"C13","v":"Antimony"},{"$f":"D13","v":"Arsenic (T) "},"Arsenic(+5)","Beryllium","Cadmium","Chrome(+6)","Chrome (T)","Copper","Cyanide","Lead","Mercury","Molybdenum","Nickel","Selenium","Silver","Thallium","Tributyl Tin","Zinc","Add #1","Add #2","Add #3","Add #4"]
[null,"Influent"]
[null,"Effluent"]
[null,"Prim._Clar."]
[null,"Sludge"]
[null,"Detection_Limit",0,0,0,0,0,0,0,0,0,0,0,0,0,0,0,0,0,0,0,0,0,0]
["Primary Removal Rate:",null,{"$f":"IF(AND(C114>C118, C114>C115, C114>C116, C116>0), ((C114-C116)/C114), \"Can't Do\")","v":"Can't Do"},{"$f":"IF(AND(D114>D118, D114>D115, D114>D116, D116>0), ((D114-D116)/D114), \"Can't Do\")","v":"Can't Do"},"Can't Do","Can't Do","Can't Do","Can't Do","Can't Do","Can't Do","Can't Do","Can't Do","Can't Do","Can't Do","Can't Do",{"$f":"IF(AND(P114>P118, P114>P115, P114>P116, P116>0), ((P114-P116)/P114), \"Can't Do\")","v":"Can't Do"},{"$f":"IF(AND(Q114>Q118, Q114>Q115, Q114>Q116, Q116>0), ((Q114-Q116)/Q114), \"Can't Do\")","v":"Can't Do"},"Can't Do","Can't Do","Can't Do","Can't Do","Can't Do","Can't Do","Can't Do"]
["Overall Removal Rate",null,{"$f":"IF(C114>C115, ((C114-C115)/C114), \"Can't Do\")","v":"Can't Do"},"Can't Do","Can't Do","Can't Do","Can't Do","Can't Do","Can't Do","Can't Do","Can't Do","Can't Do","Can't Do","Can't Do","Can't Do",{"$f":"IF(P114>P115, ((P114-P115)/P114), \"Can't Do\")","v":"Can't Do"},{"$f":"IF(Q114>Q115, ((Q114-Q115)/Q114), \"Can't Do\")","v":"Can't Do"},"Can't Do","Can't Do","Can't Do","Can't Do","Can't Do","Can't Do","Can't Do"]
[]
["SAMPLE 12",null,"Enter only dates and sampling results (white boxes in default pallate)",null,null,null,null,null,null,null,null,null,null," "]
["Date:","LOCATION",{"$f":"C13","v":"Antimony"},{"$f":"D13","v":"Arsenic (T) "},"Arsenic(+5)","Beryllium","Cadmium","Chrome(+6)","Chrome (T)","Copper","Cyanide","Lead","Mercury","Molybdenum","Nickel","Selenium","Silver","Thallium","Tributyl Tin","Zinc","Add #1","Add #2","Add #3","Add #4"]
[null,"Influent"]
[null,"Effluent"]
[null,"Prim._Clar."]
[null,"Sludge"]
[null,"Detection_Limit",0,0,0,0,0,0,0,0,0,0,0,0,0,0,0,0,0,0,0,0,0,0]
["Primary Removal Rate:",null,{"$f":"IF(AND(C124>C128, C124>C125, C124>C126, C126>0), ((C124-C126)/C124), \"Can't Do\")","v":"Can't Do"},{"$f":"IF(AND(D124>D128, D124>D125, D124>D126, D126>0), ((D124-D126)/D124), \"Can't Do\")","v":"Can't Do"},"Can't Do","Can't Do","Can't Do","Can't Do","Can't Do","Can't Do","Can't Do","Can't Do","Can't Do","Can't Do","Can't Do",{"$f":"IF(AND(P124>P128, P124>P125, P124>P126, P126>0), ((P124-P126)/P124), \"Can't Do\")","v":"Can't Do"},{"$f":"IF(AND(Q124>Q128, Q124>Q125, Q124>Q126, Q126>0), ((Q124-Q126)/Q124), \"Can't Do\")","v":"Can't Do"},"Can't Do","Can't Do","Can't Do","Can't Do","Can't Do","Can't Do","Can't Do"]
["Overall Removal Rate",null,{"$f":"IF(C124>C125, ((C124-C125)/C124), \"Can't Do\")","v":"Can't Do"},"Can't Do","Can't Do","Can't Do","Can't Do","Can't Do","Can't Do","Can't Do","Can't Do","Can't Do","Can't Do","Can't Do","Can't Do",{"$f":"IF(P124>P125, ((P124-P125)/P124), \"Can't Do\")","v":"Can't Do"},{"$f":"IF(Q124>Q125, ((Q124-Q125)/Q124), \"Can't Do\")","v":"Can't Do"},"Can't Do","Can't Do","Can't Do","Can't Do","Can't Do","Can't Do","Can't Do"]
[]
["SAMPLE 13",null,"Enter only dates and sampling results (white boxes in default pallate)",null,null,null,null,null,null,null,null,null,null," "]
["Date:","LOCATION",{"$f":"C13","v":"Antimony"},{"$f":"D13","v":"Arsenic (T) "},"Arsenic(+5)","Beryllium","Cadmium","Chrome(+6)","Chrome (T)","Copper","Cyanide","Lead","Mercury","Molybdenum","Nickel","Selenium","Silver","Thallium","Tributyl Tin","Zinc","Add #1","Add #2","Add #3","Add #4"]
[null,"Influent"]
[null,"Effluent"]
[null,"Prim._Clar."]
[null,"Sludge"]
[null,"Detection_Limit",0,0,0,0,0,0,0,0,0,0,0,0,0,0,0,0,0,0,0,0,0,0]
["Primary Removal Rate:",null,{"$f":"IF(AND(C134>C138, C134>C135, C134>C136, C136>0), ((C134-C136)/C134), \"Can't Do\")","v":"Can't Do"},{"$f":"IF(AND(D134>D138, D134>D135, D134>D136, D136>0), ((D134-D136)/D134), \"Can't Do\")","v":"Can't Do"},"Can't Do","Can't Do","Can't Do","Can't Do","Can't Do","Can't Do","Can't Do","Can't Do","Can't Do","Can't Do","Can't Do",{"$f":"IF(AND(P134>P138, P134>P135, P134>P136, P136>0), ((P134-P136)/P134), \"Can't Do\")","v":"Can't Do"},{"$f":"IF(AND(Q134>Q138, Q134>Q135, Q134>Q136, Q136>0), ((Q134-Q136)/Q134), \"Can't Do\")","v":"Can't Do"},"Can't Do","Can't Do","Can't Do","Can't Do","Can't Do","Can't Do","Can't Do"]
["Overall Removal Rate",null,{"$f":"IF(C134>C135, ((C134-C135)/C134), \"Can't Do\")","v":"Can't Do"},"Can't Do","Can't Do","Can't Do","Can't Do","Can't Do","Can't Do","Can't Do","Can't Do","Can't Do","Can't Do","Can't Do","Can't Do",{"$f":"IF(P134>P135, ((P134-P135)/P134), \"Can't Do\")","v":"Can't Do"},{"$f":"IF(Q134>Q135, ((Q134-Q135)/Q134), \"Can't Do\")","v":"Can't Do"},"Can't Do","Can't Do","Can't Do","Can't Do","Can't Do","Can't Do","Can't Do"]
[]
["SAMPLE 14",null,"Enter only dates and sampling results (white boxes in default pallate)",null,null,null,null,null,null,null,null,null,null," "]
["Date:","LOCATION",{"$f":"C13","v":"Antimony"},{"$f":"D13","v":"Arsenic (T) "},"Arsenic(+5)","Beryllium","Cadmium","Chrome(+6)","Chrome (T)","Copper","Cyanide","Lead","Mercury","Molybdenum","Nickel","Selenium","Silver","Thallium","Tributyl Tin","Zinc","Add #1","Add #2","Add #3","Add #4"]
[null,"Influent"]
[null,"Effluent"]
[null,"Prim._Clar."]
[null,"Sludge"]
[null,"Detection_Limit",0,0,0,0,0,0,0,0,0,0,0,0,0,0,0,0,0,0,0,0,0,0]
["Primary Removal Rate:",null,{"$f":"IF(AND(C144>C148, C144>C145, C144>C146, C146>0), ((C144-C146)/C144), \"Can't Do\")","v":"Can't Do"},{"$f":"IF(AND(D144>D148, D144>D145, D144>D146, D146>0), ((D144-D146)/D144), \"Can't Do\")","v":"Can't Do"},"Can't Do","Can't Do","Can't Do","Can't Do","Can't Do","Can't Do","Can't Do","Can't Do","Can't Do","Can't Do","Can't Do",{"$f":"IF(AND(P144>P148, P144>P145, P144>P146, P146>0), ((P144-P146)/P144), \"Can't Do\")","v":"Can't Do"},{"$f":"IF(AND(Q144>Q148, Q144>Q145, Q144>Q146, Q146>0), ((Q144-Q146)/Q144), \"Can't Do\")","v":"Can't Do"},"Can't Do","Can't Do","Can't Do","Can't Do","Can't Do","Can't Do","Can't Do"]
["Overall Removal Rate",null,{"$f":"IF(C144>C145, ((C144-C145)/C144), \"Can't Do\")","v":"Can't Do"},"Can't Do","Can't Do","Can't Do","Can't Do","Can't Do","Can't Do","Can't Do","Can't Do","Can't Do","Can't Do","Can't Do","Can't Do",{"$f":"IF(P144>P145, ((P144-P145)/P144), \"Can't Do\")","v":"Can't Do"},{"$f":"IF(Q144>Q145, ((Q144-Q145)/Q144), \"Can't Do\")","v":"Can't Do"},"Can't Do","Can't Do","Can't Do","Can't Do","Can't Do","Can't Do","Can't Do"]
[]
["SAMPLE 15",null,"Enter only dates and sampling results (white boxes in default pallate)",null,null,null,null,null,null,null,null,null,null," "]
["Date:","LOCATION",{"$f":"C13","v":"Antimony"},{"$f":"D13","v":"Arsenic (T) "},"Arsenic(+5)","Beryllium","Cadmium","Chrome(+6)","Chrome (T)","Copper","Cyanide","Lead","Mercury","Molybdenum","Nickel","Selenium","Silver","Thallium","Tributyl Tin","Zinc","Add #1","Add #2","Add #3","Add #4"]
[null,"Influent"]
[null,"Effluent"]
[null,"Prim._Clar."]
[null,"Sludge"]
[null,"Detection_Limit",0,0,0,0,0,0,0,0,0,0,0,0,0,0,0,0,0,0,0,0,0,0]
["Primary Removal Rate:",null,{"$f":"IF(AND(C154>C158, C154>C155, C154>C156, C156>0), ((C154-C156)/C154), \"Can't Do\")","v":"Can't Do"},{"$f":"IF(AND(D154>D158, D154>D155, D154>D156, D156>0), ((D154-D156)/D154), \"Can't Do\")","v":"Can't Do"},"Can't Do","Can't Do","Can't Do","Can't Do","Can't Do","Can't Do","Can't Do","Can't Do","Can't Do","Can't Do","Can't Do",{"$f":"IF(AND(P154>P158, P154>P155, P154>P156, P156>0), ((P154-P156)/P154), \"Can't Do\")","v":"Can't Do"},{"$f":"IF(AND(Q154>Q158, Q154>Q155, Q154>Q156, Q156>0), ((Q154-Q156)/Q154), \"Can't Do\")","v":"Can't Do"},"Can't Do","Can't Do","Can't Do","Can't Do","Can't Do","Can't Do","Can't Do"]
["Overall Removal Rate",null,{"$f":"IF(C154>C155, ((C154-C155)/C154), \"Can't Do\")","v":"Can't Do"},"Can't Do","Can't Do","Can't Do","Can't Do","Can't Do","Can't Do","Can't Do","Can't Do","Can't Do","Can't Do","Can't Do","Can't Do",{"$f":"IF(P154>P155, ((P154-P155)/P154), \"Can't Do\")","v":"Can't Do"},{"$f":"IF(Q154>Q155, ((Q154-Q155)/Q154), \"Can't Do\")","v":"Can't Do"},"Can't Do","Can't Do","Can't Do","Can't Do","Can't Do","Can't Do","Can't Do"]
[]
["SAMPLE 16",null,"Enter only dates and sampling results (white boxes in default pallate)",null,null,null,null,null,null,null,null,null,null," "]
["Date:","LOCATION",{"$f":"C13","v":"Antimony"},{"$f":"D13","v":"Arsenic (T) "},"Arsenic(+5)","Beryllium","Cadmium","Chrome(+6)","Chrome (T)","Copper","Cyanide","Lead","Mercury","Molybdenum","Nickel","Selenium","Silver","Thallium","Tributyl Tin","Zinc","Add #1","Add #2","Add #3","Add #4"]
[null,"Influent"]
[null,"Effluent"]
[null,"Prim._Clar."]
[null,"Sludge"]
[null,"Detection_Limit",0,0,0,0,0,0,0,0,0,0,0,0,0,0,0,0,0,0,0,0,0,0]
["Primary Removal Rate:",null,{"$f":"IF(AND(C164>C168, C164>C165, C164>C166, C166>0), ((C164-C166)/C164), \"Can't Do\")","v":"Can't Do"},{"$f":"IF(AND(D164>D168, D164>D165, D164>D166, D166>0), ((D164-D166)/D164), \"Can't Do\")","v":"Can't Do"},"Can't Do","Can't Do","Can't Do","Can't Do","Can't Do","Can't Do","Can't Do","Can't Do","Can't Do","Can't Do","Can't Do",{"$f":"IF(AND(P164>P168, P164>P165, P164>P166, P166>0), ((P164-P166)/P164), \"Can't Do\")","v":"Can't Do"},{"$f":"IF(AND(Q164>Q168, Q164>Q165, Q164>Q166, Q166>0), ((Q164-Q166)/Q164), \"Can't Do\")","v":"Can't Do"},"Can't Do","Can't Do","Can't Do","Can't Do","Can't Do","Can't Do","Can't Do"]
["Overall Removal Rate",null,{"$f":"IF(C164>C165, ((C164-C165)/C164), \"Can't Do\")","v":"Can't Do"},"Can't Do","Can't Do","Can't Do","Can't Do","Can't Do","Can't Do","Can't Do","Can't Do","Can't Do","Can't Do","Can't Do","Can't Do",{"$f":"IF(P164>P165, ((P164-P165)/P164), \"Can't Do\")","v":"Can't Do"},{"$f":"IF(Q164>Q165, ((Q164-Q165)/Q164), \"Can't Do\")","v":"Can't Do"},"Can't Do","Can't Do","Can't Do","Can't Do","Can't Do","Can't Do","Can't Do"]
[]
["SAMPLE 17",null,"Enter only dates and sampling results (white boxes in default pallate)",null,null,null,null,null,null,null,null,null,null," "]
["Date:","LOCATION",{"$f":"C13","v":"Antimony"},{"$f":"D13","v":"Arsenic (T) "},"Arsenic(+5)","Beryllium","Cadmium","Chrome(+6)","Chrome (T)","Copper","Cyanide","Lead","Mercury","Molybdenum","Nickel","Selenium","Silver","Thallium","Tributyl Tin","Zinc","Add #1","Add #2","Add #3","Add #4"]
[null,"Influent"]
[null,"Effluent"]
[null,"Prim._Clar."]
[null,"Sludge"]
[null,"Detection_Limit",0,0,0,0,0,0,0,0,0,0,0,0,0,0,0,0,0,0,0,0,0,0]
["Primary Removal Rate:",null,{"$f":"IF(AND(C174>C178, C174>C175, C174>C176, C176>0), ((C174-C176)/C174), \"Can't Do\")","v":"Can't Do"},{"$f":"IF(AND(D174>D178, D174>D175, D174>D176, D176>0), ((D174-D176)/D174), \"Can't Do\")","v":"Can't Do"},"Can't Do","Can't Do","Can't Do","Can't Do","Can't Do","Can't Do","Can't Do","Can't Do","Can't Do","Can't Do","Can't Do",{"$f":"IF(AND(P174>P178, P174>P175, P174>P176, P176>0), ((P174-P176)/P174), \"Can't Do\")","v":"Can't Do"},{"$f":"IF(AND(Q174>Q178, Q174>Q175, Q174>Q176, Q176>0), ((Q174-Q176)/Q174), \"Can't Do\")","v":"Can't Do"},"Can't Do","Can't Do","Can't Do","Can't Do","Can't Do","Can't Do","Can't Do"]
["Overall Removal Rate",null,{"$f":"IF(C174>C175, ((C174-C175)/C174), \"Can't Do\")","v":"Can't Do"},"Can't Do","Can't Do","Can't Do","Can't Do","Can't Do","Can't Do","Can't Do","Can't Do","Can't Do","Can't Do","Can't Do","Can't Do",{"$f":"IF(P174>P175, ((P174-P175)/P174), \"Can't Do\")","v":"Can't Do"},{"$f":"IF(Q174>Q175, ((Q174-Q175)/Q174), \"Can't Do\")","v":"Can't Do"},"Can't Do","Can't Do","Can't Do","Can't Do","Can't Do","Can't Do","Can't Do"]
[]
["SAMPLE 18",null,"Enter only dates and sampling results (white boxes in default pallate)",null,null,null,null,null,null,null,null,null,null," "]
["Date:","LOCATION",{"$f":"C13","v":"Antimony"},{"$f":"D13","v":"Arsenic (T) "},"Arsenic(+5)","Beryllium","Cadmium","Chrome(+6)","Chrome (T)","Copper","Cyanide","Lead","Mercury","Molybdenum","Nickel","Selenium","Silver","Thallium","Tributyl Tin","Zinc","Add #1","Add #2","Add #3","Add #4"]
[null,"Influent"]
[null,"Effluent"]
[null,"Prim._Clar."]
[null,"Sludge"]
[null,"Detection_Limit",0,0,0,0,0,0,0,0,0,0,0,0,0,0,0,0,0,0,0,0,0,0]
["Primary Removal Rate:",null,{"$f":"IF(AND(C184>C188, C184>C185, C184>C186, C186>0), ((C184-C186)/C184), \"Can't Do\")","v":"Can't Do"},{"$f":"IF(AND(D184>D188, D184>D185, D184>D186, D186>0), ((D184-D186)/D184), \"Can't Do\")","v":"Can't Do"},"Can't Do","Can't Do","Can't Do","Can't Do","Can't Do","Can't Do","Can't Do","Can't Do","Can't Do","Can't Do","Can't Do",{"$f":"IF(AND(P184>P188, P184>P185, P184>P186, P186>0), ((P184-P186)/P184), \"Can't Do\")","v":"Can't Do"},{"$f":"IF(AND(Q184>Q188, Q184>Q185, Q184>Q186, Q186>0), ((Q184-Q186)/Q184), \"Can't Do\")","v":"Can't Do"},"Can't Do","Can't Do","Can't Do","Can't Do","Can't Do","Can't Do","Can't Do"]
["Overall Removal Rate",null,{"$f":"IF(C184>C185, ((C184-C185)/C184), \"Can't Do\")","v":"Can't Do"},"Can't Do","Can't Do","Can't Do","Can't Do","Can't Do","Can't Do","Can't Do","Can't Do","Can't Do","Can't Do","Can't Do","Can't Do",{"$f":"IF(P184>P185, ((P184-P185)/P184), \"Can't Do\")","v":"Can't Do"},{"$f":"IF(Q184>Q185, ((Q184-Q185)/Q184), \"Can't Do\")","v":"Can't Do"},"Can't Do","Can't Do","Can't Do","Can't Do","Can't Do","Can't Do","Can't Do"]
[]
["SAMPLE 19",null,"Enter only dates and sampling results (white boxes in default pallate)",null,null,null,null,null,null,null,null,null,null," "]
["Date:","LOCATION",{"$f":"C13","v":"Antimony"},{"$f":"D13","v":"Arsenic (T) "},"Arsenic(+5)","Beryllium","Cadmium","Chrome(+6)","Chrome (T)","Copper","Cyanide","Lead","Mercury","Molybdenum","Nickel","Selenium","Silver","Thallium","Tributyl Tin","Zinc","Add #1","Add #2","Add #3","Add #4"]
[null,"Influent"]
[null,"Effluent"]
[null,"Prim._Clar."]
[null,"Sludge"]
[null,"Detection_Limit",0,0,0,0,0,0,0,0,0,0,0,0,0,0,0,0,0,0,0,0,0,0]
["Primary Removal Rate:",null,{"$f":"IF(AND(C194>C198, C194>C195, C194>C196, C196>0), ((C194-C196)/C194), \"Can't Do\")","v":"Can't Do"},{"$f":"IF(AND(D194>D198, D194>D195, D194>D196, D196>0), ((D194-D196)/D194), \"Can't Do\")","v":"Can't Do"},"Can't Do","Can't Do","Can't Do","Can't Do","Can't Do","Can't Do","Can't Do","Can't Do","Can't Do","Can't Do","Can't Do",{"$f":"IF(AND(P194>P198, P194>P195, P194>P196, P196>0), ((P194-P196)/P194), \"Can't Do\")","v":"Can't Do"},{"$f":"IF(AND(Q194>Q198, Q194>Q195, Q194>Q196, Q196>0), ((Q194-Q196)/Q194), \"Can't Do\")","v":"Can't Do"},"Can't Do","Can't Do","Can't Do","Can't Do","Can't Do","Can't Do","Can't Do"]
["Overall Removal Rate",null,{"$f":"IF(C194>C195, ((C194-C195)/C194), \"Can't Do\")","v":"Can't Do"},"Can't Do","Can't Do","Can't Do","Can't Do","Can't Do","Can't Do","Can't Do","Can't Do","Can't Do","Can't Do","Can't Do","Can't Do",{"$f":"IF(P194>P195, ((P194-P195)/P194), \"Can't Do\")","v":"Can't Do"},{"$f":"IF(Q194>Q195, ((Q194-Q195)/Q194), \"Can't Do\")","v":"Can't Do"},"Can't Do","Can't Do","Can't Do","Can't Do","Can't Do","Can't Do","Can't Do"]
[]
["SAMPLE 20",null,"Enter only dates and sampling results (white boxes in default pallate)",null,null,null,null,null,null,null,null,null,null," "]
["Date:","LOCATION",{"$f":"C13","v":"Antimony"},{"$f":"D13","v":"Arsenic (T) "},"Arsenic(+5)","Beryllium","Cadmium","Chrome(+6)","Chrome (T)","Copper","Cyanide","Lead","Mercury","Molybdenum","Nickel","Selenium","Silver","Thallium","Tributyl Tin","Zinc","Add #1","Add #2","Add #3","Add #4"]
[null,"Influent"]
[null,"Effluent"]
[null,"Prim._Clar."]
[null,"Sludge"]
[null,"Detection_Limit",0,0,0,0,0,0,0,0,0,0,0,0,0,0,0,0,0,0,0,0,0,0]
["Primary Removal Rate:",null,{"$f":"IF(AND(C204>C208, C204>C205, C204>C206, C206>0), ((C204-C206)/C204), \"Can't Do\")","v":"Can't Do"},{"$f":"IF(AND(D204>D208, D204>D205, D204>D206, D206>0), ((D204-D206)/D204), \"Can't Do\")","v":"Can't Do"},"Can't Do","Can't Do","Can't Do","Can't Do","Can't Do","Can't Do","Can't Do","Can't Do","Can't Do","Can't Do","Can't Do",{"$f":"IF(AND(P204>P208, P204>P205, P204>P206, P206>0), ((P204-P206)/P204), \"Can't Do\")","v":"Can't Do"},{"$f":"IF(AND(Q204>Q208, Q204>Q205, Q204>Q206, Q206>0), ((Q204-Q206)/Q204), \"Can't Do\")","v":"Can't Do"},"Can't Do","Can't Do","Can't Do","Can't Do","Can't Do","Can't Do","Can't Do"]
["Overall Removal Rate",null,{"$f":"IF(C204>C205, ((C204-C205)/C204), \"Can't Do\")","v":"Can't Do"},"Can't Do","Can't Do","Can't Do","Can't Do","Can't Do","Can't Do","Can't Do","Can't Do","Can't Do","Can't Do","Can't Do","Can't Do",{"$f":"IF(P204>P205, ((P204-P205)/P204), \"Can't Do\")","v":"Can't Do"},{"$f":"IF(Q204>Q205, ((Q204-Q205)/Q204), \"Can't Do\")","v":"Can't Do"},"Can't Do","Can't Do","Can't Do","Can't Do","Can't Do","Can't Do","Can't Do"]

{"sheet":"Local Limits","index":2,"n_rows":169,"n_cols":23,"rows_kept":169,"cut":false,"hidden":false,"merged":[]}
["Part I:  GENERAL INFORMATION"]
["Receiving Water Hardness (if fresh)"]
[{"$f":"'Basic Data'!C19","v":0}]
["(M)arine, (F)resh, or (B)oth Discharges"]
[{"$f":"'Basic Data'!C20","v":0},null," "]
["Sludge: Class A (A) or (C)eiling level"]
[{"$f":"'Basic Data'!C21","v":0}]
["Plant: (A)ctivated sludge or (O)ther"]
[{"$f":"'Basic Data'!C22","v":0}]
[]
["Pollutant:","Antimony","Arsenic(T)","Arsenic(+5)","Beryllium","Cadmium","Chr (+6)","Chrome (T)","Copper","Cyanide","Lead","Mercury","Molybdenum","Nickel","Selenium","Silver","Thallium","TriButylTin","Zinc",{"$f":"'Sample Data'!U13","v":"Add #1"},{"$f":"'Sample Data'!V13","v":"Add #2"},{"$f":"'Sample Data'!W13","v":"Add #3"},{"$f":"'Sample Data'!X13","v":"Add #4"}]
["Part II:  PLANT DATA - OPEN AND CHANGE \"BASICDATA.XLS\" VALUES IF FLOWS CONTRIBUTING FOR A PARTICULAR POLLUTANT VARY"]
["Total Plant Flow (in MGD)",{"$f":"'Basic Data'!$C$24","v":0},{"$f":"'Basic Data'!$C$24","v":0},{"$f":"'Basic Data'!$C$24","v":0},{"$f":"'Basic Data'!$C$24","v":0},{"$f":"'Basic Data'!$C$24","v":0},{"$f":"'Basic Data'!$C$24","v":0},{"$f":"'Basic Data'!$C$24","v":0},{"$f":"'Basic Data'!$C$24","v":0},{"$f":"'Basic Data'!$C$24","v":0},{"$f":"'Basic Data'!$C$24","v":0},{"$f":"'Basic Data'!$C$24","v":0},{"$f":"'Basic Data'!$C$24","v":0},{"$f":"'Basic Data'!$C$24","v":0},{"$f":"'Basic Data'!$C$24","v":0},{"$f":"'Basic Data'!$C$24","v":0},{"$f":"'Basic Data'!$C$24","v":0},{"$f":"'Basic Data'!$C$24","v":0},{"$f":"'Basic Data'!$C$24","v":0},{"$f":"'Basic Data'!$C$24","v":0},{"$f":"'Basic Data'!$C$24","v":0},{"$f":"'Basic Data'!$C$24","v":0},{"$f":"'Basic Data'!$C$24","v":0}]
["Domestic Flow (in MGD)",{"$f":"'Basic Data'!$C$25","v":0},{"$f":"'Basic Data'!$C$25","v":0},{"$f":"'Basic Data'!$C$25","v":0},{"$f":"'Basic Data'!$C$25","v":0},{"$f":"'Basic Data'!$C$25","v":0},{"$f":"'Basic Data'!$C$25","v":0},{"$f":"'Basic Data'!$C$25","v":0},{"$f":"'Basic Data'!$C$25","v":0},{"$f":"'Basic Data'!$C$25","v":0},{"$f":"'Basic Data'!$C$25","v":0},{"$f":"'Basic Data'!$C$25","v":0},{"$f":"'Basic Data'!$C$25","v":0},{"$f":"'Basic Data'!$C$25","v":0},{"$f":"'Basic Data'!$C$25","v":0},{"$f":"'Basic Data'!$C$25","v":0},{"$f":"'Basic Data'!$C$25","v":0},{"$f":"'Basic Data'!$C$25","v":0},{"$f":"'Basic Data'!$C$25","v":0},{"$f":"'Basic Data'!$C$25","v":0},{"$f":"'Basic Data'!$C$25","v":0},{"$f":"'Basic Data'!$C$25","v":0},{"$f":"'Basic Data'!$C$25","v":0}]
["Industrial Flow (in MGD)",{"$f":"'Basic Data'!$C$26","v":0},{"$f":"'Basic Data'!$C$26","v":0},{"$f":"'Basic Data'!$C$26","v":0},{"$f":"'Basic Data'!$C$26","v":0},{"$f":"'Basic Data'!$C$26","v":0},{"$f":"'Basic Data'!$C$26","v":0},{"$f":"'Basic Data'!$C$26","v":0},{"$f":"'Basic Data'!$C$26","v":0},{"$f":"'Basic Data'!$C$26","v":0},{"$f":"'Basic Data'!$C$26","v":0},{"$f":"'Basic Data'!$C$26","v":0},{"$f":"'Basic Data'!$C$26","v":0},{"$f":"'Basic Data'!$C$26","v":0},{"$f":"'Basic Data'!$C$26","v":0},{"$f":"'Basic Data'!$C$26","v":0},{"$f":"'Basic Data'!$C$26","v":0},{"$f":"'Basic Data'!$C$26","v":0},{"$f":"'Basic Data'!$C$26","v":0},{"$f":"'Basic Data'!$C$26","v":0},{"$f":"'Basic Data'!$C$26","v":0},{"$f":"'Basic Data'!$C$26","v":0},{"$f":"'Basic Data'!$C$26","v":0}]
["Infiltration/Inflow (by subtraction)",{"$f":"'Basic Data'!$C$27","v":0},{"$f":"'Basic Data'!$C$27","v":0},{"$f":"'Basic Data'!$C$27","v":0},{"$f":"'Basic Data'!$C$27","v":0},{"$f":"'Basic Data'!$C$27","v":0},{"$f":"'Basic Data'!$C$27","v":0},{"$f":"'Basic Data'!$C$27","v":0},{"$f":"'Basic Data'!$C$27","v":0},{"$f":"'Basic Data'!$C$27","v":0},{"$f":"'Basic Data'!$C$27","v":0},{"$f":"'Basic Data'!$C$27","v":0},{"$f":"'Basic Data'!$C$27","v":0},{"$f":"'Basic Data'!$C$27","v":0},{"$f":"'Basic Data'!$C$27","v":0},{"$f":"'Basic Data'!$C$27","v":0},{"$f":"'Basic Data'!$C$27","v":0},{"$f":"'Basic Data'!$C$27","v":0},{"$f":"'Basic Data'!$C$27","v":0},{"$f":"'Basic Data'!$C$27","v":0},{"$f":"'Basic Data'!$C$27","v":0},{"$f":"'Basic Data'!$C$27","v":0},{"$f":"'Basic Data'!$C$27","v":0}]
["Acute Dilution Factor",{"$f":"'Basic Data'!$C$28","v":0},{"$f":"'Basic Data'!$C$28","v":0},{"$f":"'Basic Data'!$C$28","v":0},{"$f":"'Basic Data'!$C$28","v":0},{"$f":"'Basic Data'!$C$28","v":0},{"$f":"'Basic Data'!$C$28","v":0},{"$f":"'Basic Data'!$C$28","v":0},{"$f":"'Basic Data'!$C$28","v":0},{"$f":"'Basic Data'!$C$28","v":0},{"$f":"'Basic Data'!$C$28","v":0},{"$f":"'Basic Data'!$C$28","v":0},{"$f":"'Basic Data'!$C$28","v":0},{"$f":"'Basic Data'!$C$28","v":0},{"$f":"'Basic Data'!$C$28","v":0},{"$f":"'Basic Data'!$C$28","v":0},{"$f":"'Basic Data'!$C$28","v":0},{"$f":"'Basic Data'!$C$28","v":0},{"$f":"'Basic Data'!$C$28","v":0},{"$f":"'Basic Data'!$C$28","v":0},{"$f":"'Basic Data'!$C$28","v":0},{"$f":"'Basic Data'!$C$28","v":0},{"$f":"'Basic Data'!$C$28","v":0}]
["Chronic Dilution Factor",{"$f":"'Basic Data'!$C$29","v":0},{"$f":"'Basic Data'!$C$29","v":0},{"$f":"'Basic Data'!$C$29","v":0},{"$f":"'Basic Data'!$C$29","v":0},{"$f":"'Basic Data'!$C$29","v":0},{"$f":"'Basic Data'!$C$29","v":0},{"$f":"'Basic Data'!$C$29","v":0},{"$f":"'Basic Data'!$C$29","v":0},{"$f":"'Basic Data'!$C$29","v":0},{"$f":"'Basic Data'!$C$29","v":0},{"$f":"'Basic Data'!$C$29","v":0},{"$f":"'Basic Data'!$C$29","v":0},{"$f":"'Basic Data'!$C$29","v":0},{"$f":"'Basic Data'!$C$29","v":0},{"$f":"'Basic Data'!$C$29","v":0},{"$f":"'Basic Data'!$C$29","v":0},{"$f":"'Basic Data'!$C$29","v":0},{"$f":"'Basic Data'!$C$29","v":0},{"$f":"'Basic Data'!$C$29","v":0},{"$f":"'Basic Data'!$C$29","v":0},{"$f":"'Basic Data'!$C$29","v":0},{"$f":"'Basic Data'!$C$29","v":0}]
["Dilution Factor for HH Limits",{"$f":"'Basic Data'!$C$30","v":0},{"$f":"'Basic Data'!$C$30","v":0},{"$f":"'Basic Data'!$C$30","v":0},{"$f":"'Basic Data'!$C$30","v":0},{"$f":"'Basic Data'!$C$30","v":0},{"$f":"'Basic Data'!$C$30","v":0},{"$f":"'Basic Data'!$C$30","v":0},{"$f":"'Basic Data'!$C$30","v":0},{"$f":"'Basic Data'!$C$30","v":0},{"$f":"'Basic Data'!$C$30","v":0},{"$f":"'Basic Data'!$C$30","v":0},{"$f":"'Basic Data'!$C$30","v":0},{"$f":"'Basic Data'!$C$30","v":0},{"$f":"'Basic Data'!$C$30","v":0},{"$f":"'Basic Data'!$C$30","v":0},{"$f":"'Basic Data'!$C$30","v":0},{"$f":"'Basic Data'!$C$30","v":0},{"$f":"'Basic Data'!$C$30","v":0},{"$f":"'Basic Data'!$C$30","v":0},{"$f":"'Basic Data'!$C$30","v":0},{"$f":"'Basic Data'!$C$30","v":0},{"$f":"'Basic Data'!$C$30","v":0}]
["Digester Flow (in MGD)",{"$f":"'Basic Data'!$C$31","v":0},{"$f":"'Basic Data'!$C$31","v":0},{"$f":"'Basic Data'!$C$31","v":0},{"$f":"'Basic Data'!$C$31","v":0},{"$f":"'Basic Data'!$C$31","v":0},{"$f":"'Basic Data'!$C$31","v":0},{"$f":"'Basic Data'!$C$31","v":0},{"$f":"'Basic Data'!$C$31","v":0},{"$f":"'Basic Data'!$C$31","v":0},{"$f":"'Basic Data'!$C$31","v":0},{"$f":"'Basic Data'!$C$31","v":0},{"$f":"'Basic Data'!$C$31","v":0},{"$f":"'Basic Data'!$C$31","v":0},{"$f":"'Basic Data'!$C$31","v":0},{"$f":"'Basic Data'!$C$31","v":0},{"$f":"'Basic Data'!$C$31","v":0},{"$f":"'Basic Data'!$C$31","v":0},{"$f":"'Basic Data'!$C$31","v":0},{"$f":"'Basic Data'!$C$31","v":0},{"$f":"'Basic Data'!$C$31","v":0},{"$f":"'Basic Data'!$C$31","v":0},{"$f":"'Basic Data'!$C$31","v":0}]
["Dry Sludge Production Rate (US Tons/day)",{"$f":"'Basic Data'!$C$32","v":0},{"$f":"'Basic Data'!$C$32","v":0},{"$f":"'Basic Data'!$C$32","v":0},{"$f":"'Basic Data'!$C$32","v":0},{"$f":"'Basic Data'!$C$32","v":0},{"$f":"'Basic Data'!$C$32","v":0},{"$f":"'Basic Data'!$C$32","v":0},{"$f":"'Basic Data'!$C$32","v":0},{"$f":"'Basic Data'!$C$32","v":0},{"$f":"'Basic Data'!$C$32","v":0},{"$f":"'Basic Data'!$C$32","v":0},{"$f":"'Basic Data'!$C$32","v":0},{"$f":"'Basic Data'!$C$32","v":0},{"$f":"'Basic Data'!$C$32","v":0},{"$f":"'Basic Data'!$C$32","v":0},{"$f":"'Basic Data'!$C$32","v":0},{"$f":"'Basic Data'!$C$32","v":0},{"$f":"'Basic Data'!$C$32","v":0},{"$f":"'Basic Data'!$C$32","v":0},{"$f":"'Basic Data'!$C$32","v":0},{"$f":"'Basic Data'!$C$32","v":0},{"$f":"'Basic Data'!$C$32","v":0}]
[]
["Part III:  CONCENTRATIONS LIMITING THE POTW DUE TO PASS THROUGH OR INTERFERENCE"]
["WQ Acute criteria, aquatic life (mg/L) ",{"$f":"IF('POTW Limits'!K$10>0,'POTW Limits'!K$10/1000, \"NA\")","v":9},{"$f":"IF('POTW Limits'!$K$11>0,'POTW Limits'!$K$11/1000, \"NA\")","v":0.36},{"$f":"IF('POTW Limits'!$K$12>0,'POTW Limits'!$K$12/1000, \"NA\")","v":0.85},{"$f":"'POTW Limits'!$K$13/1000","v":0.13},{"$f":"'POTW Limits'!$K$14/1000","v":2.2043235156118811E-3},{"$f":"'POTW Limits'!$K$15/1000","v":1.5274949083503055E-2},{"$f":"'POTW Limits'!$K$16/1000","v":1.1428360285987478},{"$f":"'POTW Limits'!$K$17/1000","v":1.0953854971797997E-2},{"$f":"'POTW Limits'!$K$18/1000","v":2.1999999999999999E-2},{"$f":"'POTW Limits'!$K$19/1000","v":4.2610496843887097E-2},{"$f":"'POTW Limits'!$K$20/1000","v":2.4705882352941176E-3},"NA",{"$f":"'POTW Limits'!$K$22/1000","v":0.92059067276442019},{"$f":"'POTW Limits'!$K$23/1000","v":0.02},{"$f":"'POTW Limits'!$K$24/1000","v":1.6858546518933068E-3},{"$f":"'POTW Limits'!$K$25/1000","v":1.4},{"$f":"'POTW Limits'!$K$26/1000","v":4.6000000000000001E-4},{"$f":"'POTW Limits'!$K$27/1000","v":7.5909219614452877E-2},{"$f":"'POTW Limits'!$K$29/1000","v":0},{"$f":"IF('POTW Limits'!K$30>0,'POTW Limits'!K$30/1000, \"NA\")","v":"NA"},{"$f":"'POTW Limits'!$K$31/1000","v":0},{"$f":"IF('POTW Limits'!K$32>0,'POTW Limits'!K$32/1000, \"NA\")","v":"NA"}]
["WQ Chronic criteria, aquatic life (mg/L)",{"$f":"IF('POTW Limits'!L$10>0,'POTW Limits'!L$10/1000, \"NA\")","v":1.6},{"$f":"'POTW Limits'!$L$11/1000","v":0.19},{"$f":"'POTW Limits'!L12/1000","v":4.8000000000000001E-2},{"$f":"'POTW Limits'!$L$13/1000","v":5.3E-3},{"$f":"'POTW Limits'!$L$14/1000","v":8.357967841639692E-4},{"$f":"'POTW Limits'!$L$15/1000","v":1.0395010395010396E-2},{"$f":"IF(ISNUMBER('POTW Limits'!$L$16),'POTW Limits'!$L$16/1000,\"NA\")","v":0.13621958734212225},{"$f":"IF(ISNUMBER('POTW Limits'!$L$17),'POTW Limits'!$L$17/1000,\"NA\")","v":7.6416796494442225E-3},{"$f":"IF(ISNUMBER('POTW Limits'!$L$18),'POTW Limits'!$L$18/1000,\"NA\")","v":5.1999999999999998E-3},{"$f":"'POTW Limits'!$L$19/1000","v":1.6604698885569146E-3},{"$f":"'POTW Limits'!$L$20/1000","v":1.2E-5},"NA",{"$f":"'POTW Limits'!$L$22/1000","v":0.10234152449490506},{"$f":"'POTW Limits'!$L$23/1000","v":5.0000000000000001E-3},{"$f":"IF(ISNUMBER('POTW Limits'!$L$24),'POTW Limits'!$L$24/1000,\"NA\")","v":"NA"},{"$f":"'POTW Limits'!$L$25/1000","v":0.04},{"$f":"'POTW Limits'!$L$26/1000","v":6.3E-5},{"$f":"'POTW Limits'!$L$27/1000","v":6.8754222137548809E-2},{"$f":"'POTW Limits'!L$29/1000","v":0},{"$f":"IF('POTW Limits'!L$30>0,'POTW Limits'!L$30/1000, \"NA\")","v":"NA"},{"$f":"'POTW Limits'!L$31/1000","v":0},{"$f":"IF('POTW Limits'!L$32>0,'POTW Limits'!L$32/1000, \"NA\")","v":"NA"}]
["WQ Chronic criteria, human health (mg/L)",{"$f":"'POTW Limits'!$M$10/1000","v":1.4E-2},"NA","NA","NA","NA","NA","NA","NA",{"$f":"'POTW Limits'!$M18/1000","v":0.7},"NA",{"$f":"'POTW Limits'!$M20/1000","v":1.4000000000000001E-4},"NA",{"$f":"'POTW Limits'!$M22/1000","v":0.61},{"$f":"'POTW Limits'!$M23/1000","v":0.17},"NA",{"$f":"'POTW Limits'!$M$25/1000","v":1.6999999999999999E-3},"NA","NA",{"$f":"'POTW Limits'!M$29/1000","v":0},{"$f":"'POTW Limits'!M$30/1000","v":0},{"$f":"'POTW Limits'!M$31/1000","v":0},{"$f":"'POTW Limits'!M$32/1000","v":0}]
["Activated Sludge Inhibition Level","NA",0.1,0.1,"NA",1,1,10,1,0.1,1,0.1,"NA",1,"NA",0.25,"NA","NA",0.3]
["Anaerobic Digestor Inhibition Level","NA",1.6,1.6,"NA",20,110,"NA",40,4,340,"NA","NA",10,"NA",13,"NA","NA",400]
["Class A Sludge standards (40 CFR 503)","NA",41,41,"NA",39,"NA","NA",1500,"NA",300,17,75,420,100,"NA","NA","NA",2800]
["Sludge ceiling concentration for beneficial use","NA",75,75,"NA",85,"NA","NA",4300,"NA",840,57,75,420,100,"NA","NA","NA",7500]
[]
["Part IV:  POLLUTANT CONCENTRATION        ------      SUMMARY",null,null,null,null,null,null,null,null,null," ",null,null," "]
["Estimated Average Industrial Conc.",{"$f":"'Sample Data'!C10/1000","v":0},{"$f":"'Sample Data'!D10/1000","v":0},{"$f":"'Sample Data'!E10/1000","v":0},{"$f":"'Sample Data'!F10/1000","v":0},{"$f":"'Sample Data'!G10/1000","v":0},{"$f":"'Sample Data'!H10/1000","v":0},{"$f":"'Sample Data'!I10/1000","v":0},{"$f":"'Sample Data'!J10/1000","v":0},{"$f":"'Sample Data'!K10/1000","v":0},{"$f":"'Sample Data'!L10/1000","v":0},{"$f":"'Sample Data'!M10/1000","v":0},{"$f":"'Sample Data'!N10/1000","v":0},{"$f":"'Sample Data'!O10/1000","v":0},{"$f":"'Sample Data'!P10/1000","v":0},{"$f":"'Sample Data'!Q10/1000","v":0},{"$f":"'Sample Data'!R10/1000","v":0},{"$f":"'Sample Data'!S10/1000","v":0},{"$f":"'Sample Data'!T10/1000","v":0},{"$f":"'Sample Data'!U10/1000","v":0},{"$f":"'Sample Data'!V10/1000","v":0},{"$f":"'Sample Data'!W10/1000","v":0},{"$f":"'Sample Data'!X10/1000","v":0}]
["Ambient Concentration (receiving water)",{"$f":"'Sample Data'!C9/1000","v":0},{"$f":"'Sample Data'!D9/1000","v":0},{"$f":"'Sample Data'!E9/1000","v":1.1999999999999999E-4},{"$f":"'Sample Data'!F9/1000","v":0},{"$f":"'Sample Data'!G9/1000","v":0},{"$f":"'Sample Data'!H9/1000","v":0},{"$f":"'Sample Data'!I9/1000","v":0},{"$f":"'Sample Data'!J9/1000","v":0},{"$f":"'Sample Data'!K9/1000","v":0},{"$f":"'Sample Data'!L9/1000","v":0},{"$f":"'Sample Data'!M9/1000","v":0},{"$f":"'Sample Data'!N9/1000","v":0},{"$f":"'Sample Data'!O9/1000","v":0},{"$f":"'Sample Data'!P9/1000","v":0},{"$f":"'Sample Data'!Q9/1000","v":0},{"$f":"'Sample Data'!R9/1000","v":0},{"$f":"'Sample Data'!S9/1000","v":0},{"$f":"'Sample Data'!T9/1000","v":0},{"$f":"'Sample Data'!U9/1000","v":0},{"$f":"'Sample Data'!V9/1000","v":0},{"$f":"'Sample Data'!W9/1000","v":0},{"$f":"'Sample Data'!X9/1000","v":0}]
["Adjusted Domestic concentration",{"$f":"IF(B51=\"Y\",IF(B38>0,IF((B38*B13-B33*B15)>0,(B38*B13-B33*B15)/(B13-B15),0),IF((B36*B13-B33*B15)>0,(B36*B13-B33*B15)/(B13-B15),0)),IF(B38>0,B38,B36))","v":{"$error":"#DIV/0!"}},{"$error":"#DIV/0!"},1.4999999999999999E-2,{"$error":"#DIV/0!"},{"$error":"#DIV/0!"},{"$error":"#DIV/0!"},{"$error":"#DIV/0!"},{"$error":"#DIV/0!"},{"$error":"#DIV/0!"},{"$error":"#DIV/0!"},{"$error":"#DIV/0!"},{"$error":"#DIV/0!"},{"$error":"#DIV/0!"},{"$error":"#DIV/0!"},{"$error":"#DIV/0!"},{"$error":"#DIV/0!"},null,{"$f":"IF(S51=\"Y\",IF(S38>0,IF((S38*S13-S33*S15)>0,(S38*S13-S33*S15)/(S13-S15),0),IF((S36*S13-S33*S15)>0,(S36*S13-S33*S15)/(S13-S15),0)),IF(S38>0,S38,S36))","v":{"$error":"#DIV/0!"}},{"$f":"IF(T51=\"Y\",IF(T38>0,IF((T38*T13-T33*T15)>0,(T38*T13-T33*T15)/(T13-T15),0),IF((T36*T13-T33*T15)>0,(T36*T13-T33*T15)/(T13-T15),0)),IF(T38>0,T38,T36))","v":{"$error":"#DIV/0!"}},{"$f":"IF(U51=\"Y\",IF(U38>0,IF((U38*U13-U33*U15)>0,(U38*U13-U33*U15)/(U13-U15),0),IF((U36*U13-U33*U15)>0,(U36*U13-U33*U15)/(U13-U15),0)),IF(U38>0,U38,U36))","v":{"$error":"#DIV/0!"}},{"$f":"IF(V51=\"Y\",IF(V38>0,IF((V38*V13-V33*V15)>0,(V38*V13-V33*V15)/(V13-V15),0),IF((V36*V13-V33*V15)>0,(V36*V13-V33*V15)/(V13-V15),0)),IF(V38>0,V38,V36))","v":{"$error":"#DIV/0!"}},{"$f":"IF(W51=\"Y\",IF(W38>0,IF((W38*W13-W33*W15)>0,(W38*W13-W33*W15)/(W13-W15),0),IF((W36*W13-W33*W15)>0,(W36*W13-W33*W15)/(W13-W15),0)),IF(W38>0,W38,W36))","v":{"$error":"#DIV/0!"}}]
["Typical Domestic Concentrations",3.0000000000000001E-3,3.0000000000000001E-3,0,0,3.0000000000000001E-3,1E-3,0.05,6.0999999999999999E-2,4.1000000000000002E-2,4.9000000000000002E-2,2.9999999999999997E-4,0.01,2.1000000000000001E-2,1E-3,5.0000000000000001E-3,0,0,0.17499999999999999,0,0,0,0]
["Average Sludge Level (mg/Kg - Dry)",{"$f":"'Sample Data'!C8","v":{"$error":"#DIV/0!"}},{"$f":"'Sample Data'!D8","v":{"$error":"#DIV/0!"}},{"$f":"'Sample Data'!E8","v":18},{"$f":"'Sample Data'!F8","v":{"$error":"#DIV/0!"}},{"$f":"'Sample Data'!G8","v":{"$error":"#DIV/0!"}},{"$f":"'Sample Data'!H8","v":{"$error":"#DIV/0!"}},{"$f":"'Sample Data'!I8","v":{"$error":"#DIV/0!"}},{"$f":"'Sample Data'!J8","v":{"$error":"#DIV/0!"}},{"$f":"'Sample Data'!K8","v":{"$error":"#DIV/0!"}},{"$f":"'Sample Data'!L8","v":{"$error":"#DIV/0!"}},{"$f":"'Sample Data'!M8","v":{"$error":"#DIV/0!"}},{"$f":"'Sample Data'!N8","v":{"$error":"#DIV/0!"}},{"$f":"'Sample Data'!O8","v":{"$error":"#DIV/0!"}},{"$f":"'Sample Data'!P8","v":{"$error":"#DIV/0!"}},{"$f":"'Sample Data'!Q8","v":{"$error":"#DIV/0!"}},{"$f":"'Sample Data'!R8","v":{"$error":"#DIV/0!"}},{"$f":"'Sample Data'!S8","v":{"$error":"#DIV/0!"}},{"$f":"'Sample Data'!T8","v":{"$error":"#DIV/0!"}},{"$f":"'Sample Data'!U8","v":{"$error":"#DIV/0!"}},{"$f":"'Sample Data'!V8","v":{"$error":"#DIV/0!"}},{"$f":"'Sample Data'!W8","v":{"$error":"#DIV/0!"}},{"$f":"'Sample Data'!X8","v":{"$error":"#DIV/0!"}}]
["Average Influent Level (mg/l)",{"$f":"'Sample Data'!C3/1000","v":{"$error":"#DIV/0!"}},{"$f":"'Sample Data'!D3/1000","v":{"$error":"#DIV/0!"}},{"$f":"'Sample Data'!E3/1000","v":1.4999999999999999E-2},{"$f":"'Sample Data'!F3/1000","v":{"$error":"#DIV/0!"}},{"$f":"'Sample Data'!G3/1000","v":{"$error":"#DIV/0!"}},{"$f":"'Sample Data'!H3/1000","v":{"$error":"#DIV/0!"}},{"$f":"'Sample Data'!I3/1000","v":{"$error":"#DIV/0!"}},{"$f":"'Sample Data'!J3/1000","v":{"$error":"#DIV/0!"}},{"$f":"'Sample Data'!K3/1000","v":{"$error":"#DIV/0!"}},{"$f":"'Sample Data'!L3/1000","v":{"$error":"#DIV/0!"}},{"$f":"'Sample Data'!M3/1000","v":{"$error":"#DIV/0!"}},{"$f":"'Sample Data'!N3/1000","v":{"$error":"#DIV/0!"}},{"$f":"'Sample Data'!O3/1000","v":{"$error":"#DIV/0!"}},{"$f":"'Sample Data'!P3/1000","v":{"$error":"#DIV/0!"}},{"$f":"'Sample Data'!Q3/1000","v":{"$error":"#DIV/0!"}},{"$f":"'Sample Data'!R3/1000","v":{"$error":"#DIV/0!"}},{"$f":"'Sample Data'!S3/1000","v":{"$error":"#DIV/0!"}},{"$f":"'Sample Data'!T3/1000","v":{"$error":"#DIV/0!"}},{"$f":"'Sample Data'!U3/1000","v":{"$error":"#DIV/0!"}},{"$f":"'Sample Data'!V3/1000","v":{"$error":"#DIV/0!"}},{"$f":"'Sample Data'!W3/1000","v":{"$error":"#DIV/0!"}},{"$f":"'Sample Data'!X3/1000","v":{"$error":"#DIV/0!"}}]
["Average Effluent Level (mg/l)",{"$f":"'Sample Data'!C4/1000","v":{"$error":"#DIV/0!"}},{"$f":"'Sample Data'!D4/1000","v":{"$error":"#DIV/0!"}},{"$f":"'Sample Data'!E4/1000","v":6.0000000000000001E-3},{"$f":"'Sample Data'!F4/1000","v":{"$error":"#DIV/0!"}},{"$f":"'Sample Data'!G4/1000","v":{"$error":"#DIV/0!"}},{"$f":"'Sample Data'!H4/1000","v":{"$error":"#DIV/0!"}},{"$f":"'Sample Data'!I4/1000","v":{"$error":"#DIV/0!"}},{"$f":"'Sample Data'!J4/1000","v":{"$error":"#DIV/0!"}},{"$f":"'Sample Data'!K4/1000","v":{"$error":"#DIV/0!"}},{"$f":"'Sample Data'!L4/1000","v":{"$error":"#DIV/0!"}},{"$f":"'Sample Data'!M4/1000","v":{"$error":"#DIV/0!"}},{"$f":"'Sample Data'!N4/1000","v":{"$error":"#DIV/0!"}},{"$f":"'Sample Data'!O4/1000","v":{"$error":"#DIV/0!"}},{"$f":"'Sample Data'!P4/1000","v":{"$error":"#DIV/0!"}},{"$f":"'Sample Data'!Q4/1000","v":{"$error":"#DIV/0!"}},{"$f":"'Sample Data'!R4/1000","v":{"$error":"#DIV/0!"}},{"$f":"'Sample Data'!S4/1000","v":{"$error":"#DIV/0!"}},{"$f":"'Sample Data'!T4/1000","v":{"$error":"#DIV/0!"}},{"$f":"'Sample Data'!U4/1000","v":{"$error":"#DIV/0!"}},{"$f":"'Sample Data'!V4/1000","v":{"$error":"#DIV/0!"}},{"$f":"'Sample Data'!W4/1000","v":{"$error":"#DIV/0!"}},{"$f":"'Sample Data'!X4/1000","v":{"$error":"#DIV/0!"}}]
[]
["Part V:  REMOVAL RATES"]
["Average Primary Removal Rate",{"$f":"'Sample Data'!C$5","v":{"$error":"#DIV/0!"}},{"$f":"'Sample Data'!D$5","v":{"$error":"#DIV/0!"}},{"$f":"'Sample Data'!E$5","v":0.4},{"$f":"'Sample Data'!F$5","v":{"$error":"#DIV/0!"}},{"$f":"'Sample Data'!G$5","v":{"$error":"#DIV/0!"}},{"$f":"'Sample Data'!H$5","v":{"$error":"#DIV/0!"}},{"$f":"'Sample Data'!I$5","v":{"$error":"#DIV/0!"}},{"$f":"'Sample Data'!J$5","v":{"$error":"#DIV/0!"}},{"$f":"'Sample Data'!K$5","v":{"$error":"#DIV/0!"}},{"$f":"'Sample Data'!L$5","v":{"$error":"#DIV/0!"}},{"$f":"'Sample Data'!M$5","v":{"$error":"#DIV/0!"}},{"$f":"'Sample Data'!N$5","v":{"$error":"#DIV/0!"}},{"$f":"'Sample Data'!O$5","v":{"$error":"#DIV/0!"}},{"$f":"'Sample Data'!P$5","v":{"$error":"#DIV/0!"}},{"$f":"'Sample Data'!Q$5","v":{"$error":"#DIV/0!"}},{"$f":"'Sample Data'!R$5","v":{"$error":"#DIV/0!"}},{"$f":"'Sample Data'!S$5","v":{"$error":"#DIV/0!"}},{"$f":"'Sample Data'!T$5","v":{"$error":"#DIV/0!"}},{"$f":"'Sample Data'!U$5","v":{"$error":"#DIV/0!"}},{"$f":"'Sample Data'!V$5","v":{"$error":"#DIV/0!"}},{"$f":"'Sample Data'!W$5","v":{"$error":"#DIV/0!"}},{"$f":"'Sample Data'!X$5","v":{"$error":"#DIV/0!"}}]
["Average Overall Removal Rate",{"$f":"'Sample Data'!C$6","v":{"$error":"#DIV/0!"}},{"$f":"'Sample Data'!D$6","v":{"$error":"#DIV/0!"}},{"$f":"'Sample Data'!E$6","v":0.6},{"$f":"'Sample Data'!F$6","v":{"$error":"#DIV/0!"}},{"$f":"'Sample Data'!G$6","v":{"$error":"#DIV/0!"}},{"$f":"'Sample Data'!H$6","v":{"$error":"#DIV/0!"}},{"$f":"'Sample Data'!I$6","v":{"$error":"#DIV/0!"}},{"$f":"'Sample Data'!J$6","v":{"$error":"#DIV/0!"}},{"$f":"'Sample Data'!K$6","v":{"$error":"#DIV/0!"}},{"$f":"'Sample Data'!L$6","v":{"$error":"#DIV/0!"}},{"$f":"'Sample Data'!M$6","v":{"$error":"#DIV/0!"}},{"$f":"'Sample Data'!N$6","v":{"$error":"#DIV/0!"}},{"$f":"'Sample Data'!O$6","v":{"$error":"#DIV/0!"}},{"$f":"'Sample Data'!P$6","v":{"$error":"#DIV/0!"}},{"$f":"'Sample Data'!Q$6","v":{"$error":"#DIV/0!"}},{"$f":"'Sample Data'!R$6","v":{"$error":"#DIV/0!"}},{"$f":"'Sample Data'!S$6","v":{"$error":"#DIV/0!"}},{"$f":"'Sample Data'!T$6","v":{"$error":"#DIV/0!"}},{"$f":"'Sample Data'!U$6","v":{"$error":"#DIV/0!"}},{"$f":"'Sample Data'!V$6","v":{"$error":"#DIV/0!"}},{"$f":"'Sample Data'!W$6","v":{"$error":"#DIV/0!"}},{"$f":"'Sample Data'!X$6","v":{"$error":"#DIV/0!"}}]
["Reference Primary Removal Rate",null,0.1,0.1,null,0.15,0.27,0.22,0.22,0.27,0.56999999999999995,0.1,null,0.14000000000000001," ",0.2,null,null,0.27]
["Reference 2d Decile Plant Removal",0.35,0.31,0.31,null,0.33,0.68,0.68,0.67,0.41,0.39,0.5,null,0.25,0.33,0.5,0.35,null,0.64]
["Reference Ave Plant Removal",0.5,0.45,0.45,null,0.67,0.82,0.82,0.86,0.69,0.61,0.6,0.8,0.42,0.5,0.75,0.5,0,0.79]
["Reference 8th Decile Removal",null,0.53,0.53,null,0.91,0.91,0.91,0.95,0.84,0.76,0.79,null,0.62,0.67,0.88,null,null,0.88]
[]
["Part VI:  HOW TO CALCULATE LIMITS:"]
["Sampling Data Available (inf, eff, sludge) (Y/N)",{"$f":"'Basic Data'!$C$35","v":0},{"$f":"'Basic Data'!$C$35","v":0},{"$f":"'Basic Data'!$C$35","v":0},{"$f":"'Basic Data'!$C$35","v":0},{"$f":"'Basic Data'!$C$35","v":0},{"$f":"'Basic Data'!$C$35","v":0},{"$f":"'Basic Data'!$C$35","v":0},{"$f":"'Basic Data'!$C$35","v":0},{"$f":"'Basic Data'!$C$35","v":0},{"$f":"'Basic Data'!$C$35","v":0},{"$f":"'Basic Data'!$C$35","v":0},{"$f":"'Basic Data'!$C$35","v":0},{"$f":"'Basic Data'!$C$35","v":0},{"$f":"'Basic Data'!$C$35","v":0},{"$f":"'Basic Data'!$C$35","v":0},{"$f":"'Basic Data'!$C$35","v":0},{"$f":"'Basic Data'!$C$35","v":0},{"$f":"'Basic Data'!$C$35","v":0},{"$f":"'Basic Data'!$C$35","v":0},{"$f":"'Basic Data'!$C$35","v":0},{"$f":"'Basic Data'!$C$35","v":0},{"$f":"'Basic Data'!$C$35","v":0}]
["Credit present loading of existing sources (Y/N)",{"$f":"'Basic Data'!$C$36","v":0},{"$f":"'Basic Data'!$C$36","v":0},{"$f":"'Basic Data'!$C$36","v":0},{"$f":"'Basic Data'!$C$36","v":0},{"$f":"'Basic Data'!$C$36","v":0},{"$f":"'Basic Data'!$C$36","v":0},{"$f":"'Basic Data'!$C$36","v":0},{"$f":"'Basic Data'!$C$36","v":0},{"$f":"'Basic Data'!$C$36","v":0},{"$f":"'Basic Data'!$C$36","v":0},{"$f":"'Basic Data'!$C$36","v":0},{"$f":"'Basic Data'!$C$36","v":0},{"$f":"'Basic Data'!$C$36","v":0},{"$f":"'Basic Data'!$C$36","v":0},{"$f":"'Basic Data'!$C$36","v":0},{"$f":"'Basic Data'!$C$36","v":0},{"$f":"'Basic Data'!$C$36","v":0},{"$f":"'Basic Data'!$C$36","v":0},{"$f":"'Basic Data'!$C$36","v":0},{"$f":"'Basic Data'!$C$36","v":0},{"$f":"'Basic Data'!$C$36","v":0},{"$f":"'Basic Data'!$C$36","v":0}]
["Adjust for receiving water pollution",{"$f":"'Basic Data'!$C$37","v":0},{"$f":"'Basic Data'!$C$37","v":0},{"$f":"'Basic Data'!$C$37","v":0},{"$f":"'Basic Data'!$C$37","v":0},{"$f":"'Basic Data'!$C$37","v":0},{"$f":"'Basic Data'!$C$37","v":0},{"$f":"'Basic Data'!$C$37","v":0},{"$f":"'Basic Data'!$C$37","v":0},{"$f":"'Basic Data'!$C$37","v":0},{"$f":"'Basic Data'!$C$37","v":0},{"$f":"'Basic Data'!$C$37","v":0},{"$f":"'Basic Data'!$C$37","v":0},{"$f":"'Basic Data'!$C$37","v":0},{"$f":"'Basic Data'!$C$37","v":0},{"$f":"'Basic Data'!$C$37","v":0},{"$f":"'Basic Data'!$C$37","v":0},{"$f":"'Basic Data'!$C$37","v":0},{"$f":"'Basic Data'!$C$37","v":0},{"$f":"'Basic Data'!$C$37","v":0},{"$f":"'Basic Data'!$C$37","v":0},{"$f":"'Basic Data'!$C$37","v":0},{"$f":"'Basic Data'!$C$37","v":0}]
["Use Observed Overall Removal Rate (Y/N)",{"$f":"'Basic Data'!$C38","v":0},{"$f":"'Basic Data'!$C38","v":0},{"$f":"'Basic Data'!$C38","v":0},{"$f":"'Basic Data'!$C38","v":0},{"$f":"'Basic Data'!$C38","v":0},{"$f":"'Basic Data'!$C38","v":0},{"$f":"'Basic Data'!$C38","v":0},{"$f":"'Basic Data'!$C38","v":0},{"$f":"'Basic Data'!$C38","v":0},{"$f":"'Basic Data'!$C38","v":0},{"$f":"'Basic Data'!$C38","v":0},{"$f":"'Basic Data'!$C38","v":0},{"$f":"'Basic Data'!$C38","v":0},{"$f":"'Basic Data'!$C38","v":0},{"$f":"'Basic Data'!$C38","v":0},{"$f":"'Basic Data'!$C38","v":0},{"$f":"'Basic Data'!$C38","v":0},{"$f":"'Basic Data'!$C38","v":0},{"$f":"'Basic Data'!$C38","v":0},{"$f":"'Basic Data'!$C38","v":0},{"$f":"'Basic Data'!$C38","v":0},{"$f":"'Basic Data'!$C38","v":0}]
["Use Observed Primary Removal Rate (Y/N)",{"$f":"'Basic Data'!$C39","v":0},{"$f":"'Basic Data'!$C39","v":0},{"$f":"'Basic Data'!$C39","v":0},{"$f":"'Basic Data'!$C39","v":0},{"$f":"'Basic Data'!$C39","v":0},{"$f":"'Basic Data'!$C39","v":0},{"$f":"'Basic Data'!$C39","v":0},{"$f":"'Basic Data'!$C39","v":0},{"$f":"'Basic Data'!$C39","v":0},{"$f":"'Basic Data'!$C39","v":0},{"$f":"'Basic Data'!$C39","v":0},{"$f":"'Basic Data'!$C39","v":0},{"$f":"'Basic Data'!$C39","v":0},{"$f":"'Basic Data'!$C39","v":0},{"$f":"'Basic Data'!$C39","v":0},{"$f":"'Basic Data'!$C39","v":0},{"$f":"'Basic Data'!$C39","v":0},{"$f":"'Basic Data'!$C39","v":0},{"$f":"'Basic Data'!$C39","v":0},{"$f":"'Basic Data'!$C39","v":0},{"$f":"'Basic Data'!$C39","v":0},{"$f":"'Basic Data'!$C39","v":0}]
[]
["Part VII: LOCAL LIMITS CORRESPONDING TO THE CRITERIA ABOVE BASED ON COMPLIANCE WITH:"]
["Acute WQ Standards (in mg/l)",{"$f":"Acute(B13,B14,B15,B17,B24,B33,B34,B35,B36,B38,B43,B46,B50,B51,B52,B53)","v":0},{"$f":"Acute(C13,C14,C15,C17,C24,C33,C34,C35,C36,C38,C43,C46,C50,C51,C52,C53)","v":0},{"$f":"Acute(D13,D14,D15,D17,D24,D33,D34,D35,D36,D38,D43,D46,D50,D51,D52,D53)","v":0},{"$f":"Acute(E13,E14,E15,E17,E24,E33,E34,E35,E36,E38,E43,E46,E50,E51,E52,E53)","v":0},{"$f":"Acute(F13,F14,F15,F17,F24,F33,F34,F35,F36,F38,F43,F46,F50,F51,F52,F53)","v":0},{"$f":"Acute(G13,G14,F15,G17,G24,G33,G34,G35,G36,G38,G43,G46,G50,G51,G52,G53)","v":0},{"$f":"Acute(H13,H14,H15,H17,H24,H33,H34,H35,H36,H38,H43,H46,H50,H51,H52,H53)","v":0},{"$f":"Acute(I13,I14,I15,I17,I24,I33,I34,I35,I36,I38,I43,I46,I50,I51,I52,I53)","v":0},{"$f":"Acute(J13,J14,J15,J17,J24,J33,J34,J35,J36,J38,J43,J46,J50,J51,J52,J53)","v":0},{"$f":"Acute(K13,K14,K15,K17,K24,K33,K34,K35,K36,K38,K43,K46,K50,K51,K52,K53)","v":0},{"$f":"Acute(L13,L14,L15,L17,L24,L33,L34,L35,L36,L38,L43,L46,L50,L51,L52,L53)","v":0},"NA",{"$f":"Acute(N13,N14,N15,N17,N24,N33,N34,N35,N36,N38,N43,N46,N50,N51,N52,N53)","v":0},{"$f":"Acute(O13,O14,O15,O17,O24,O33,O34,O35,O36,O38,O43,O46,O50,O51,O52,O53)","v":0},{"$f":"Acute(P13,P14,P15,P17,P24,P33,P34,P35,P36,P38,P43,P46,P50,P51,P52,P53)","v":0},"NA",{"$f":"Acute(R13,R14,R15,R17,R24,R33,R34,R35,R36,R38,R43,R46,R50,R51,R52,R53)","v":0},0,0,"NA",0,"NA"]
["Chronic WQ Standards (in mg/l)",{"$f":"Chronic(B13,B14,B15,B18,B25,B33,B34,B35,B36,B38,B43,B46,B50,B51,B52,B53)","v":0},0,0,0,0,0,"NA",{"$f":"Chronic(I13,I14,I15,I18,I25,I33,I34,I35,I36,I38,I43,I46,I50,I51,I52,I53)","v":0},{"$f":"Chronic(J13,J14,J15,J18,J25,J33,J34,J35,J36,J38,J43,J46,J50,J51,J52,J53)","v":0},{"$f":"Chronic(K13,K14,K15,K18,K25,K33,K34,K35,K36,K38,K43,K46,K50,K51,K52,K53)","v":0},{"$f":"Chronic(L13,L14,L15,L18,L25,L33,L34,L35,L36,L38,L43,L46,L50,L51,L52,L53)","v":0},"NA",{"$f":"Chronic(N13,N14,N15,N18,N25,N33,N34,N35,N36,N38,N43,N46,N50,N51,N52,N53)","v":0},{"$f":"Chronic(O13,O14,O15,O18,O25,O33,O34,O35,O36,O38,O43,O46,O50,O51,O52,O53)","v":0},"NA ","NA",{"$f":"Chronic(R13,R14,R15,R18,R25,R33,R34,R35,R36,R38,R43,R46,R50,R51,R52,R53)","v":0},{"$f":"Chronic(S13,S14,S15,S18,S25,S33,S34,S35,S36,S38,S43,S46,S50,S51,S52,S53)","v":0},{"$f":"Chronic(T13,T14,T15,T18,T25,T33,T34,T35,T36,T38,T43,T46,T50,T51,T52,T53)","v":0},"NA",0,"NA"]
["HH Limits (in mg/L)",{"$f":"Hhealth(B13,B14,B15,B19,B26,B33,B34,B35,B36,B38,B43,B46,B50,B51,B52,B53)","v":0},"NA","NA","NA","NA","NA","NA","NA",{"$f":"Hhealth(J13,J14,J15,J19,J26,J33,J34,J35,J36,J38,J43,J46,J50,J51,J52,J53)","v":0},"NA",{"$f":"Hhealth(L13,L14,L15,L19,L26,L33,L34,L35,L36,L38,L43,L46,L50,L51,L52,L53)","v":0},"NA",{"$f":"Hhealth(N13,N14,N15,N19,N26,N33,N34,N35,N36,N38,N43,N46,N50,N51,N52,N53)","v":0},{"$f":"Hhealth(O13,O14,O15,O19,O26,O33,O34,O35,O36,O38,O43,O46,O50,O51,O52,O53)","v":0},"NA ",{"$f":"Hhealth(Q13,Q14,Q15,Q19,Q26,Q33,Q34,Q35,Q36,Q38,Q43,Q46,Q50,Q51,Q52,Q53)","v":0},"NA","NA",{"$f":"Hhealth(T13,T14,T15,T19,T26,T33,T34,T35,T36,T38,T43,T46,T50,T51,T52,T53)","v":0},{"$f":"Hhealth(U13,U14,U15,U19,U26,U33,U34,U35,U36,U38,U43,U46,U50,U51,U52,U53)","v":0},{"$f":"Hhealth(V13,V14,V15,V19,V26,V33,V34,V35,V36,V38,V43,V46,V50,V51,V52,V53)","v":0},{"$f":"Hhealth(W13,W14,W15,W19,W26,W33,W34,W35,W36,W38,W43,W46,W50,W51,W52,W53)","v":0}]
["Sludge Application Limits (in mg/l)","NA",{"$f":"Sludge($A$7,C13,C15,C21,C29,C30,C33,C35,C36,C37,C38,C43,C46,C50,C51,C52,C53)","v":{"$error":"#VALUE!"}},{"$f":"Sludge($A$7,D13,D15,D21,D29,D30,D33,D35,D36,D37,D38,D43,D46,D50,D51,D52,D53)","v":{"$error":"#VALUE!"}},"NA",{"$f":"Sludge($A$7,F13,F15,F21,F29,F30,F33,F35,F36,F37,F38,F43,F46,F50,F51,F52,F53)","v":{"$error":"#VALUE!"}},"NA","NA",{"$f":"Sludge($A$7,I13,I15,I21,I29,I30,I33,I35,I36,I37,I38,I43,I46,I50,I51,I52,I53)","v":{"$error":"#VALUE!"}},"NA",{"$f":"Sludge($A$7,K13,K15,K21,K29,K30,K33,K35,K36,K37,K38,K43,K46,K50,K51,K52,K53)","v":{"$error":"#VALUE!"}},{"$f":"Sludge($A$7,L13,L15,L21,L29,L30,L33,L35,L36,L37,L38,L43,L46,L50,L51,L52,L53)","v":{"$error":"#VALUE!"}},{"$f":"Sludge($A$7,M13,M15,M21,M29,M30,M33,M35,M36,M37,M38,M43,M46,M50,M51,M52,M53)","v":{"$error":"#VALUE!"}},{"$f":"Sludge($A$7,N13,N15,N21,N29,N30,N33,N35,N36,N37,N38,N43,N46,N50,N51,N52,N53)","v":{"$error":"#VALUE!"}},{"$f":"Sludge($A$7,O13,O15,O21,O29,O30,O33,O35,O36,O37,O38,O43,O46,O50,O51,O52,O53)","v":{"$error":"#VALUE!"}},"NA ","NA","NA",{"$f":"Sludge($A$7,S13,S15,S21,S29,S30,S33,S35,S36,S37,S38,S43,S46,S50,S51,S52,S53)","v":{"$error":"#VALUE!"}},{"$f":"IF(Sludge($A$7,T13,T15,T21,T29,T30,T33,T35,T36,T37,T38,T43,T46,T50,T51,T52,T53)>0, Sludge($A$7,T13,T15,T21,T29,T30,T33,T35,T36,T37,T38,T43,T46,T50,T51,T52,T53), \"NA\")","v":{"$error":"#VALUE!"}},{"$f":"IF(Sludge($A$7,U13,U15,U21,U29,U30,U33,U35,U36,U37,U38,U43,U46,U50,U51,U52,U53)>0, Sludge($A$7,U13,U15,U21,U29,U30,U33,U35,U36,U37,U38,U43,U46,U50,U51,U52,U53), \"NA\")","v":{"$error":"#VALUE!"}},{"$f":"IF(Sludge($A$7,V13,V15,V21,V29,V30,V33,V35,V36,V37,V38,V43,V46,V50,V51,V52,V53)>0, Sludge($A$7,V13,V15,V21,V29,V30,V33,V35,V36,V37,V38,V43,V46,V50,V51,V52,V53), \"NA\")","v":{"$error":"#VALUE!"}},{"$f":"IF(Sludge($A$7,W13,W15,W21,W29,W30,W33,W35,W36,W37,W38,W43,W46,W50,W51,W52,W53)>0, Sludge($A$7,W13,W15,W21,W29,W30,W33,W35,W36,W37,W38,W43,W46,W50,W51,W52,W53), \"NA\")","v":{"$error":"#VALUE!"}}]
["Activated Sludge Inhibition (in mg/l)","NA",{"$f":"ASInhib($A$9,C13,C15,C27,C33,C35,C36,C38,C42,C44,C50,C51,C54)","v":"NA"},"NA","NA",{"$f":"ASInhib($A$9,F13,F15,F27,F33,F35,F36,F38,F42,F44,F50,F51,F54)","v":"NA"},"NA","NA","NA","NA","NA","NA","NA",{"$f":"ASInhib($A$9,N13,N15,N27,N33,N35,N36,N38,N42,N44,N50,N51,N54)","v":"NA"},"NA",{"$f":"ASInhib($A$9,P13,P15,P27,P33,P35,P36,P38,P42,P44,P50,P51,P54)","v":"NA"},"NA","NA",{"$f":"ASInhib($A$9,S13,S15,S27,S33,S35,S36,S38,S42,S44,S50,S51,S54)","v":"NA"},{"$f":"IF(ASInhib($A$9,T13,T15,T27,T33,T35,T36,T38,T42,T44,T50,T51,T54)>0,ASInhib($A$9,T13,T15,T27,T33,T35,T36,T38,T42,T44,T50,T51,T54),\"NA\")","v":"NA"},{"$f":"IF(ASInhib($A$9,U13,U15,U27,U33,U35,U36,U38,U42,U44,U50,U51,U54)>0,ASInhib($A$9,U13,U15,U27,U33,U35,U36,U38,U42,U44,U50,U51,U54),\"NA\")","v":"NA"},{"$f":"IF(ASInhib($A$9,V13,V15,V27,V33,V35,V36,V38,V42,V44,V50,V51,V54)>0,ASInhib($A$9,V13,V15,V27,V33,V35,V36,V38,V42,V44,V50,V51,V54),\"NA\")","v":"NA"},{"$f":"IF(ASInhib($A$9,W13,W15,W27,W33,W35,W36,W38,W42,W44,W50,W51,W54)>0,ASInhib($A$9,W13,W15,W27,W33,W35,W36,W38,W42,W44,W50,W51,W54),\"NA\")","v":"NA"}]
["Anaerobic Digestor Inhibition (in mg/l)","NA",{"$f":"Digestor(C13,C15,C20,C28,C33,C35,C36,C38,C43,C46,C50,C51,C53)","v":{"$error":"#VALUE!"}},"NA","NA",{"$f":"Digestor(F13,F15,F20,F28,F33,F35,F36,F38,F43,F46,F50,F51,F53)","v":{"$error":"#VALUE!"}},{"$f":"Digestor(G13,F15,G20,G28,G33,G35,G36,G38,G43,G46,G50,G51,G53)","v":{"$error":"#VALUE!"}},"NA",{"$f":"Digestor(I13,I15,I20,I28,I33,I35,I36,I38,I43,I46,I50,I51,I53)","v":{"$error":"#VALUE!"}},{"$f":"J38*(J28/((J37*(J21*2000)/(J20*1000000*8.34))))*(J13/J15)","v":{"$error":"#DIV/0!"}},{"$f":"Digestor(K13,K15,K20,K28,K33,K35,K36,K38,K43,K46,K50,K51,K53)","v":{"$error":"#VALUE!"}},"NA","NA",{"$f":"Digestor(N13,N15,N20,N28,N33,N35,N36,N38,N43,N46,N50,N51,N53)","v":{"$error":"#VALUE!"}},"NA",{"$f":"Digestor(P13,P15,P20,P28,P33,P35,P36,P38,P43,P46,P50,P51,P53)","v":{"$error":"#VALUE!"}},"NA","NA",{"$f":"Digestor(S13,S15,S20,S28,S33,S35,S36,S38,S43,S46,S50,S51,S53)","v":{"$error":"#VALUE!"}},{"$f":"IF(Digestor(T13,T15,T20,T28,T33,T35,T36,T38,T43,T46,T50,T51,T53)>0,Digestor(T13,T15,T20,T28,T33,T35,T36,T38,T43,T46,T50,T51,T53),\"NA\")","v":{"$error":"#VALUE!"}},{"$f":"IF(Digestor(U13,U15,U20,U28,U33,U35,U36,U38,U43,U46,U50,U51,U53)>0,Digestor(U13,U15,U20,U28,U33,U35,U36,U38,U43,U46,U50,U51,U53),\"NA\")","v":{"$error":"#VALUE!"}},{"$f":"IF(Digestor(V13,V15,V20,V28,V33,V35,V36,V38,V43,V46,V50,V51,V53)>0,Digestor(V13,V15,V20,V28,V33,V35,V36,V38,V43,V46,V50,V51,V53),\"NA\")","v":{"$error":"#VALUE!"}},{"$f":"IF(Digestor(W13,W15,W20,W28,W33,W35,W36,W38,W43,W46,W50,W51,W53)>0,Digestor(W13,W15,W20,W28,W33,W35,W36,W38,W43,W46,W50,W51,W53),\"NA\")","v":{"$error":"#VALUE!"}}]
[]
["Part VIII:  SAMPLE QUALITY:  COMPARISON OF LOADINGS AND REMOVAL RATES IMPLIED BY SAMPLE DATA"]
["Pollutants in Influent (per sampling)",{"$f":"(B13*B38)*8.34","v":{"$error":"#DIV/0!"}},{"$error":"#DIV/0!"},0,{"$error":"#DIV/0!"},{"$error":"#DIV/0!"},{"$error":"#DIV/0!"},{"$error":"#DIV/0!"},{"$error":"#DIV/0!"},{"$error":"#DIV/0!"},{"$error":"#DIV/0!"},{"$error":"#DIV/0!"},{"$error":"#DIV/0!"},{"$error":"#DIV/0!"},{"$error":"#DIV/0!"},{"$error":"#DIV/0!"},{"$error":"#DIV/0!"},{"$error":"#DIV/0!"},{"$error":"#DIV/0!"},{"$error":"#DIV/0!"},{"$error":"#DIV/0!"},{"$error":"#DIV/0!"},{"$error":"#DIV/0!"}]
["Pollutants in biosolids (per sampling)",{"$f":"(B21*2000*B37/1000000)","v":{"$error":"#DIV/0!"}},{"$error":"#DIV/0!"},0,{"$error":"#DIV/0!"},{"$error":"#DIV/0!"},{"$error":"#DIV/0!"},{"$error":"#DIV/0!"},{"$error":"#DIV/0!"},{"$error":"#DIV/0!"},{"$error":"#DIV/0!"},{"$error":"#DIV/0!"},{"$error":"#DIV/0!"},{"$error":"#DIV/0!"},{"$error":"#DIV/0!"},{"$error":"#DIV/0!"},{"$error":"#DIV/0!"},{"$error":"#DIV/0!"},{"$error":"#DIV/0!"},{"$error":"#DIV/0!"},{"$error":"#DIV/0!"},{"$error":"#DIV/0!"},{"$error":"#DIV/0!"}]
["Pollutants in effluent (per sampling)",{"$f":"(B13-B20)*'Sample Data'!C$4*8.34/1000","v":{"$error":"#DIV/0!"}},{"$f":"(C13-C20)*'Sample Data'!D$4*8.34/1000","v":{"$error":"#DIV/0!"}},{"$f":"(D13-D20)*'Sample Data'!E$4*8.34/1000","v":0},{"$f":"(E13-E20)*'Sample Data'!E$4*8.34/1000","v":0},{"$f":"(F13-F20)*'Sample Data'!F$4*8.34/1000","v":{"$error":"#DIV/0!"}},{"$f":"(G13-G20)*'Sample Data'!G$4*8.34/1000","v":{"$error":"#DIV/0!"}},{"$f":"(H13-H20)*'Sample Data'!H$4*8.34/1000","v":{"$error":"#DIV/0!"}},{"$f":"(I13-I20)*'Sample Data'!I$4*8.34/1000","v":{"$error":"#DIV/0!"}},{"$f":"(J13-J20)*'Sample Data'!J$4*8.34/1000","v":{"$error":"#DIV/0!"}},{"$f":"(K13-K20)*'Sample Data'!K$4*8.34/1000","v":{"$error":"#DIV/0!"}},{"$f":"(L13-L20)*'Sample Data'!L$4*8.34/1000","v":{"$error":"#DIV/0!"}},{"$f":"(M13-M20)*'Sample Data'!M$4*8.34/1000","v":{"$error":"#DIV/0!"}},{"$f":"(N13-N20)*'Sample Data'!N$4*8.34/1000","v":{"$error":"#DIV/0!"}},{"$f":"(O13-O20)*'Sample Data'!O$4*8.34/1000","v":{"$error":"#DIV/0!"}},{"$f":"(P13-P20)*'Sample Data'!P$4*8.34/1000","v":{"$error":"#DIV/0!"}},{"$f":"(Q13-Q20)*'Sample Data'!Q$4*8.34/1000","v":{"$error":"#DIV/0!"}},{"$f":"(R13-R20)*'Sample Data'!Q$4*8.34/1000","v":{"$error":"#DIV/0!"}},{"$f":"(S13-S20)*'Sample Data'!R$4*8.34/1000","v":{"$error":"#DIV/0!"}},{"$f":"(T13-T20)*'Sample Data'!S$4*8.34/1000","v":{"$error":"#DIV/0!"}},{"$f":"(U13-U20)*'Sample Data'!T$4*8.34/1000","v":{"$error":"#DIV/0!"}},{"$f":"(V13-V20)*'Sample Data'!U$4*8.34/1000","v":{"$error":"#DIV/0!"}},{"$f":"(W13-W20)*'Sample Data'!V$4*8.34/1000","v":{"$error":"#DIV/0!"}}]
["% Influent load accounted for: (eff/inf)",{"$f":"(((B21*B37*0.002)+(B13-B20)*B39*8.34))/(B13*B38*8.34)","v":{"$error":"#DIV/0!"}},{"$error":"#DIV/0!"},{"$error":"#DIV/0!"},{"$error":"#DIV/0!"},{"$error":"#DIV/0!"},{"$error":"#DIV/0!"},{"$error":"#DIV/0!"},{"$error":"#DIV/0!"},{"$error":"#DIV/0!"},{"$error":"#DIV/0!"},{"$error":"#DIV/0!"},{"$error":"#DIV/0!"},{"$error":"#DIV/0!"},{"$error":"#DIV/0!"},{"$error":"#DIV/0!"},{"$error":"#DIV/0!"},{"$error":"#DIV/0!"},{"$error":"#DIV/0!"},{"$error":"#DIV/0!"},{"$error":"#DIV/0!"},{"$error":"#DIV/0!"},{"$error":"#DIV/0!"}]
["Current HW Load Implied by Sludge Data:",{"$f":"IF(B53=\"Y\",(B66/B43),((B66/B46)))","v":{"$error":"#DIV/0!"}},{"$f":"IF(C46<>0,(C66/C46)/C73,((C66/C43)/C73))","v":{"$error":"#DIV/0!"}},{"$f":"IF(D46<>0,(D66/D46)/D73,((D66/D43)/D73))","v":{"$error":"#VALUE!"}},{"$f":"IF(E46<>0,(E66/E46)/E73,((E66/E43)/E73))","v":{"$error":"#DIV/0!"}},{"$error":"#DIV/0!"},{"$error":"#DIV/0!"},{"$error":"#DIV/0!"},{"$error":"#DIV/0!"},{"$error":"#DIV/0!"},{"$error":"#DIV/0!"},{"$error":"#DIV/0!"},{"$error":"#DIV/0!"},{"$error":"#DIV/0!"},{"$error":"#DIV/0!"},{"$error":"#DIV/0!"},{"$error":"#DIV/0!"},{"$f":"((R66/R43)/R73)","v":{"$error":"#DIV/0!"}},{"$error":"#DIV/0!"},{"$error":"#DIV/0!"},{"$error":"#DIV/0!"},{"$error":"#DIV/0!"},{"$error":"#DIV/0!"}]
["Local Limit implied by %max Biosolids level  ","NA",{"$f":"(((C29-C37)/C37)*C38*C13)/C15","v":{"$error":"#DIV/0!"}},{"$f":"(((D29-D37)/D37)*D38*D13)/D15","v":{"$error":"#DIV/0!"}},"NA",{"$f":"(((F29-F37)/F37)*F38*F13)/F15","v":{"$error":"#DIV/0!"}},"NA","NA",{"$f":"(((I29-I37)/I37)*I38*I13)/I15","v":{"$error":"#DIV/0!"}},"NA",{"$f":"(((K29-K37)/K37)*K38*K13)/K15","v":{"$error":"#DIV/0!"}},{"$f":"(((L29-L37)/L37)*L38*L13)/L15","v":{"$error":"#DIV/0!"}},{"$f":"(((M29-M37)/M37)*M38*M13)/M15","v":{"$error":"#DIV/0!"}},{"$f":"(((N29-N37)/N37)*N38*N13)/N15","v":{"$error":"#DIV/0!"}},{"$f":"(((O29-O37)/O37)*O38*O13)/O15","v":{"$error":"#DIV/0!"}},"NA","NA","NA",{"$f":"(((S29-S37)/S37)*S38*S13)/S15","v":{"$error":"#DIV/0!"}},"NA","NA","NA","NA"]
[]
["PART IX:  MASS BASED ANALYSIS"]
["Limiting MAHL (Dom Load + LL*IUflow)",{"$f":"((B35*(B13-B15))+(B15*B77))*8.34","v":{"$error":"#DIV/0!"}},{"$f":"((C35*(C13-C15))+(C15*C77))*8.34","v":{"$error":"#DIV/0!"}},{"$f":"((D35*(D13-D15))+(D15*D77))*8.34","v":{"$error":"#VALUE!"}},{"$error":"#DIV/0!"},{"$error":"#DIV/0!"},{"$error":"#DIV/0!"},{"$error":"#DIV/0!"},{"$error":"#DIV/0!"},{"$error":"#DIV/0!"},{"$error":"#DIV/0!"},{"$error":"#DIV/0!"},{"$error":"#DIV/0!"},{"$error":"#DIV/0!"},{"$error":"#DIV/0!"},{"$error":"#DIV/0!"},{"$error":"#DIV/0!"},{"$f":"((R35*(R13-R15))+(R15*R77))*8.34","v":0},{"$error":"#DIV/0!"},{"$error":"#DIV/0!"},{"$error":"#DIV/0!"},{"$error":"#DIV/0!"},{"$error":"#DIV/0!"}]
["Max. Allowable Industrial Loading",{"$f":"B77*B15*(8.34)","v":0},{"$error":"#VALUE!"},{"$error":"#VALUE!"},0,{"$error":"#VALUE!"},{"$error":"#VALUE!"},0,{"$error":"#VALUE!"},{"$error":"#DIV/0!"},{"$error":"#VALUE!"},{"$error":"#VALUE!"},{"$error":"#VALUE!"},{"$error":"#VALUE!"},{"$error":"#VALUE!"},{"$error":"#VALUE!"},0,0,{"$f":"S77*S15*(8.34)","v":{"$error":"#VALUE!"}},{"$f":"T77*T15*(8.34)","v":{"$error":"#VALUE!"}},{"$f":"U77*U15*(8.34)","v":{"$error":"#VALUE!"}},{"$f":"V77*V15*(8.34)","v":{"$error":"#VALUE!"}},{"$f":"W77*W15*(8.34)","v":{"$error":"#VALUE!"}}]
[]
["Part X:  LOCAL LIMIT RECAP:",{"$f":"B11","v":"Antimony"},{"$f":"C11","v":"Arsenic(T)"},"Arsenic(+5)","Beryllium","Cadmium","Chr (+6)","Chrome (T)","Copper","Cyanide","Lead","Mercury","Molybdenum","Nickel","Selenium","Silver","Thallium","TriButylTin","Zinc","Add #1","Add #2","Add #3","Add #4"]
["Lowest Limit",{"$f":"MIN(B57,B58,B59,B60,B61,B62)","v":0},{"$f":"MIN(C57,C58,C59,C60,C61,C62)","v":{"$error":"#VALUE!"}},{"$error":"#VALUE!"},{"$f":"MIN(E57,E58,E59,E60,E61,E62)","v":0},{"$error":"#VALUE!"},{"$error":"#VALUE!"},0,{"$error":"#VALUE!"},{"$error":"#DIV/0!"},{"$error":"#VALUE!"},{"$error":"#VALUE!"},{"$error":"#VALUE!"},{"$error":"#VALUE!"},{"$error":"#VALUE!"},{"$error":"#VALUE!"},0,0,{"$error":"#VALUE!"},{"$f":"MIN(T57,T58,T59,T60,T61,T62)","v":{"$error":"#VALUE!"}},{"$error":"#VALUE!"},{"$error":"#VALUE!"},{"$error":"#VALUE!"}]
[{"$f":"'Basic Data'!C40","v":0},{"$f":"B77*(1/(1+$A$78))","v":0},{"$error":"#VALUE!"},{"$error":"#VALUE!"},{"$f":"E77*(1/(1+$A$78))","v":0},{"$error":"#VALUE!"},{"$error":"#VALUE!"},0,{"$error":"#VALUE!"},{"$error":"#DIV/0!"},{"$error":"#VALUE!"},{"$error":"#VALUE!"},{"$error":"#VALUE!"},{"$error":"#VALUE!"},{"$error":"#VALUE!"},{"$error":"#VALUE!"},0,0,{"$error":"#VALUE!"},{"$f":"T77*(1/(1+$A$78))","v":{"$error":"#VALUE!"}},{"$error":"#VALUE!"},{"$error":"#VALUE!"},{"$error":"#VALUE!"}]
["Proposed Limit (MANUALLY ENTER)",null,null,"None"]
[]
[]
[]
[]
[]
[]
[]
[]
[]
[]
[]
[]
[]
[]
[]
[]
[]
[]
[]
[]
[]
[]
[]
[]
[]
[]
[]
[]
[]
[]
[]
[]
[]
[]
[]
[]
[]
[]
[]
[]
[]
[]
[]
[]
[]
[]
[]
[]
[]
[]
[]
[]
[]
[]
[]
[]
[]
[]
[]
[]
[]
[]
[]
[]
[]
[]
[]
[]
[]
[]
[]
[]
[]
[]
[]
[]
[]
[]
[]
[]
[]
[]
[]
[]
[]
[]
[" ",null," "]
[" ",null," "]
[" ",null," "]
[" ",null," "]

{"sheet":"POTW Limits","index":3,"n_rows":403,"n_cols":16,"rows_kept":403,"cut":false,"hidden":false,"merged":[[197,7,197,8],[198,5,198,6]]}
["SPREADSHEET BASED On SHEET CREATED BY D. NUNNALLEE, REV. 1-92 BY G. SHERVEY, MOD BY D. Knight 8-02"]
[null,null,null,"FACILITY: ",{"$f":"'Basic Data'!C14","v":0}]
[null,null,null,"RUN DATE:",{"$f":"TODAY()","v":"2010-06-16"}]
["WATER QUALITY CRITERIA CALCULATIONS (in ug/L unless otherwise noted)"]
["Receiving Water: (F)resh, (M)arine, (B)oth",{"$f":"'Basic Data'!C20","v":0}]
["Hardness for Use in Calculations:",60]
[null,"PRIOR","CAR","WATER QUALITY STANDARD",null,null,null,null,null,null,"TOTAL","TOTAL","Total","Conv. Fact."]
[null,"ITY ","CIN","FRESH",null,null,"MARINE",null,null,null,"LIMITING","LIMITING ","LIMITING","Marine ","Fresh","Fresh "]
["POLLUTANT","PLTNT?","GEN?","ACUTE","CHRONIC","Hhealth","ACUTE","CHRONIC","Hhealth","COMMENTS","ACUTE","CHRONIC","HH","dis/tot","Acute","Chronic"]
["Antimony (i)",null,null,{"$f":"D213","v":9000},{"$f":"E213","v":1600},{"$f":"H213","v":14},null,null,{"$f":"I213","v":4300},null,{"$f":"IF($B$5=\"F\", D10/O10, IF($B$5=\"M\", G10/N10, IF($B$5=\"B\", D10/O10, \"Complete box B5!\")))","v":9000},{"$f":"IF($B$5=\"F\", E10/P10, IF($B$5=\"M\", H10/N10, IF($B$5=\"B\", E10/P10, \"Complete box B5!\")))","v":1600},{"$f":"IF($B$5=\"F\", IF(F10>0,F10,0), IF($B$5=\"M\",IF(I10>0,I10,0), IF($B$5=\"B\",IF(F10<I10, F10, IF(I10>0, I10,0)),\"Complete box B5!\")))","v":14},1,1,1]
["ARSENIC (T)","Y","Y",360,190,null,69,36,null,"WAC 173-201A",{"$f":"IF($B$5=\"F\", D11/O11, IF($B$5=\"M\", G11/N11, IF($B$5=\"B\", IF(D11<G11, D11/O11, G11/N11), \"Complete box B5!\")))","v":360},{"$f":"IF($B$5=\"F\", E11/P11, IF($B$5=\"M\", H11/N11, IF($B$5=\"B\", IF(E11<H11, E11/P11, H11/N11), \"Complete box B5!\")))","v":190},"NA",1,1,1]
["      ARSENIC(PENT)","Y","Y",850,48,null,2319,13,null,"Gold Book",850,{"$f":"IF($B$5=\"F\", E12/P12, IF($B$5=\"M\", H12/N12, IF($B$5=\"B\", IF(E12<H12, E12/P12, H12/N12), \"Complete box B5!\")))","v":48},"NA",1,1,1]
["Beryllium",null,null,{"$f":"D227","v":130},{"$f":"E227","v":5.3},null,null,null,null,"Gold Book",{"$f":"IF($B$5=\"F\", D13/O13, IF($B$5=\"M\", G13/N13, IF($B$5=\"B\", D13/O13, \"Complete box B5!\")))","v":130},{"$f":"IF($B$5=\"F\", E13/P13, IF($B$5=\"M\", H13/N13, IF($B$5=\"B\", E13/P13, \"Complete box B5!\")))","v":5.3},"NA",1,1,1]
["CADMIUM - Dependent on Hardness in $B$6","Y","N",{"$f":"(1.136672-((LN($B$6))*(0.041838)))*EXP(1.128*(LN($B$6))-3.828)","v":2.1279939912775108},{"$f":"(1.101672-((LN($B$6))*(0.041838)))*EXP(0.7852*(LN($B$6))-3.49)","v":0.70659999610685831},null,42,9.3000000000000007,null,"WAC 173-201A",2.2043235156118812,0.83579678416396919,"NA",0.99399999999999999,{"$f":"(1.136672-((LN($B$6))*(0.041838)))","v":0.96537281220575166},{"$f":"(1.01672-((LN($B$6))*(0.041838)))","v":0.84542081220575183}]
["CHROMIUM(HEX)","Y","N",15,10,null,1100,50,null,null,15.274949083503055,10.395010395010395,"NA",0.99299999999999999,0.98199999999999998,0.96199999999999997]
["CHROMIUM(T) - Dependent on hardness in $B$6","N","N",{"$f":"(0.316)*EXP(0.819*(LN($B$6))+3.688)","v":361.13618503720431},{"$f":"(0.86)*EXP(0.819*(LN($B$6))+1.561)","v":117.14884511422514},null,10300,"NA",null,"WAC 173-201A, ",1142.8360285987478,{"$f":"IF($B$5=\"F\", E16/P16, IF($B$5=\"M\", H16, IF($B$5=\"B\", IF(E16<H16, E16/P16, H16), \"Complete box B5!\")))","v":136.21958734212225},"NA",1,0.316,0.86]
["COPPER - Dependent on Hardness in $B$6","Y","N",{"$f":"0.96*EXP(0.9422*(LN($B$6))-1.464)","v":10.515700772926076},{"$f":"(0.96)*EXP(0.8545*(LN($B$6))-1.465)","v":7.3360124634664539},null,4.8,3.1,null,"WAC 173-201A",10.953854971797996,7.6416796494442227,"NA",0.83,0.96,0.96]
["CYANIDE","Y","N",22,5.2,700,1,1,220000,"WAC 173-201A",22,{"$f":"IF($B$5=\"F\", E18/P18, IF($B$5=\"M\", H18, IF($B$5=\"B\", IF(E18<H18, E18/P18, H18), \"Complete box B5!\")))","v":5.2},{"$f":"IF($B$5=\"F\", IF(F18>0,F18,0), IF($B$5=\"M\",IF(I18>0,I18,0), IF($B$5=\"B\",IF(F18<I18, F18, IF(I18>0, I18,0)),\"Complete box B5!\")))","v":700},1,1,1]
["LEAD - Dependent on hardness in $B$6","Y","N",{"$f":"(1.46203-((LN($B$6))*(0.145712)))*EXP(1.273*(LN($B$6))-1.46)","v":36.876609590042335},{"$f":"(1.46203-((LN($B$6))*(0.145712)))*EXP(1.273*(LN($B$6))-4.705)","v":1.4370285340880475},null,210,8.1,null,"WAC 173-201A, ",42.610496843887098,1.6604698885569147,"NA",0.95099999999999996,{"$f":"(1.46203-((LN($B$6))*(0.145712)))","v":0.86543486514949319},{"$f":"(1.46203-((LN($B$6))*(0.145712)))","v":0.86543486514949319}]
["MERCURY","Y","N",2.1,1.2E-2,0.14000000000000001,1.8,2.5000000000000001E-2,0.15,"WAC 173-201A, ",2.4705882352941178,1.2E-2,0.14000000000000001,0.85,0.85,1]
["Molybdenum","N","N",null,null,null,null,null,null,null,null,null,"NA"]
["NICKEL - Dependent on hardness in $B$6","Y","N",{"$f":"(0.998)*(EXP(0.846*(LN($B$6))+3.3612))","v":918.74949141889135},{"$f":"(0.997)*(EXP(0.846*(LN($B$6))+1.1645))","v":102.03449992142035},610,74,8.1999999999999993,4600,"WAC 173-201A, ",920.59067276442022,102.34152449490506,610,0.99,0.998,0.997]
["SELENIUM","Y","N",20,5,170,290,71,11000,"WAC 173-201A, ",20,5,170,0.998,1,1]
["SILVER - Dependent on hardness in $B$6. ","Y","N",{"$f":"0.85*EXP(1.72*(LN($B$6))-6.52)","v":1.4329764541093108},"NA",null,1.9,"NA",null,"WAC 173-201A,",1.6858546518933069,{"$f":"IF($B$5=\"F\", E24, IF($B$5=\"M\", H24, IF($B$5=\"B\", IF(E24<H24, E24, H24), \"Complete box B5!\")))","v":"NA"},"NA",0.85,0.85,1]
["Thallium",null,null,{"$f":"D374","v":1400},{"$f":"E374","v":40},{"$f":"H374","v":1.7},{"$f":"F374","v":2130},null,{"$f":"I374","v":6.3},null,1400,40,1.7,1,1,1]
["Tributyl Tin (TBT)",null,null,{"$f":"D378","v":0.46},{"$f":"E378","v":6.3E-2},null,{"$f":"F378","v":0.37},{"$f":"G378","v":0.01},null,null,0.46,6.3E-2,"NA",1,1,1]
["ZINC- Dependent on hardness in $B$6","Y","N",{"$f":"0.978*EXP(0.8473*(LN($B$6))+0.8604)","v":74.239216782934918},{"$f":"0.986*EXP(0.8473*(LN($B$6))+0.7614)","v":67.79166302762313},null,90,81,null,"WAC 173-201A, ",75.90921961445288,68.754222137548808,"NA",0.94599999999999995,0.97799999999999998,0.98599999999999999]
["Arsenic (inorganic) ","Y","N",null,null,1.7999999999999999E-2,null,null,0.14000000000000001,"National Toxics Rule",0,0,1.7999999999999999E-2,1,1,1]
[{"$f":"'Local Limits'!T11","v":"Add #1"},null,null,null,null,null,null,null,null,null,0,0,0,1,1,1]
[{"$f":"'Local Limits'!U11","v":"Add #2"},null,null,null,null,null,null,null,null," ",0,0,0,1,1,1]
[{"$f":"'Local Limits'!V11","v":"Add #3"},null,null,null,null,null,null,null,null,null,0,0,0,1,1,1]
[{"$f":"'Local Limits'!W11","v":"Add #4"},null,null,null,null,null,null,null,null,null,0,0,0,1,1,1]
[null,null,null,null,null,null,null,null,null,null,0,0,0,1,1,1]
[null,null,null,null,null,null,null,null,null,null,0,0,0,1,1,1]
[]
[]
[]
[]
[]
[]
[]
[]
[]
[]
[]
[]
[]
[]
[]
[]
[]
[]
[]
[]
[]
[]
[]
["HARDNESS VALUE USED FOR HARDNESS DEPENDENT LIMITS>>>>",null,null,null,{"$f":"B206","v":"Y"},null,"mg/L"]
["* = INSUFFIFIENT DATA TO DEVELOP CRITERIA "]
["VALUE PRESENTED IS TH L.O.E.L- LOWEST OBSERVED"]
[]
[]
[]
[]
[]
[]
[]
[]
[]
["THIS SPREADSHEET USES NAMED RANGES."]
["THESE INSTRUCTIONS ARE NAMED '??'."]
["THE MAIN TABLE OF POLLUTANTS"]
["IS NAMED 'TABLE.'  USE THE F5"]
["\"GO TO\" KEY TO GO TO THE TOP OF THE TABLE."]
["THE PRINT AREA IS NAMED '1', YOU MAY USE THE NAME"]
["TO BOTH GO TO THE TABLE AND AS A PRINT RANGE."]
["'1' IS COLUMNS A THRU G AND ROWS 1 THRU 63."]
[]
["ENTER THE HARDNESS AT THE TOP OF THE TABLE."]
["HARDNESS WILL THEN BE TRANSFERRED TO "]
["EVERY PARAMETER THAT IS HARDNESS "]
["DEPENDENT.  COPY LINE ENTRIES FROM THE "]
["TABLE UP TO '1'.  FORMULAS IN THE TABLE ARE SET "]
["AS ABSOLUTE, SO THE COPY PROCESS WILL NOT HARM"]
["THE FORMULAS OR ALTER THE VALUES."]
[]
["FILL IN THE FACILITY NAME, DATE, ETC."]
["BY USING THE F2 \"EDIT\" KEY."]
[]
[null,null,null,null,null,null,null,null,null,null," ",null,null,null," "]
[]
[]
[]
[]
[]
[]
[]
[]
[]
[]
[]
[]
[]
[]
[]
[]
[]
[]
[]
[]
[]
[]
[]
[]
[]
[]
[]
[]
[]
[]
[]
[]
[]
[]
[]
[]
[]
[]
[]
[]
[]
[]
[]
[]
[]
[]
[]
[]
[]
[]
[]
[]
[]
[]
[]
[]
[]
[]
[]
[]
[]
[]
[]
[]
[]
[]
[]
[]
[]
[]
[]
[]
[]
[]
[]
[]
[]
[]
[]
[]
[]
[]
[]
[]
[]
[]
[]
[]
[]
[]
[]
[]
[]
[]
[]
[]
[]
["< Click \"+\" to restore spaces in between pollutants used and other values"]
[]
[]
[]
[]
[]
[]
[]
[]
["  WATER QUALITY CRITERIA  (in ug/L unless otherwise noted)"]
[null,"PRIOR","CAR","Water Quality Criteria",null,null,null,"Human Health Criteria",null,"Organoleptic",null,"Metals Translators"]
["","ITY ","CIN","Fresh",null,"Marine",null,null,null,"Effects","Source and ","Freshwater",null,"Marine"]
["Pollutant, CAS No. & Application Ref. No.","PLTNT?","GEN?","acute","chronic","acute","chronic","Fresh","Marine",null,"Comments","Acute","Chronic","Acute","Chronic"]
["ENTER RECEIVING WATER TSS (IF UNKNOWN LEAVE BLANK)  > ",0]
["IF RECEIVING WATER TSS IS ANNUAL DATA INSERT A, OR IF FROM CRITICAL PERIOD INSERT S>","S"]
["ENTER HARDNESS>>>>>>>>>",{"$f":"'Basic Data'!C19","v":0}]
[]
["ACENAPTHENE  83329   1B","Y","N","1,700.*","520.*","970.*","710*",1200,2700,20,"Gold Book, FR 63, 237-HH"]
["ACROLEIN 107028  1V","Y","N","68.*","21.*","55.*",null,320,780,null,"NTR, Gold Book"]
["ACRYLONITRILE 107131  2V","Y","Y","7,550.*","2,600.*",null,null,5.8999999999999997E-2,0.66,null,"Gold Book, NTR - HH"]
["ALKALINITY","N","N",null,"20,000."," ",null,null,null,null,"Gold Book"]
["ALDRIN  309002  1P","Y","Y",2.5,1.9E-3,0.71,1.9E-3,1.2999999999999999E-4,1.3999999999999999E-4,null,"WAC 173-201A, NTR"]
["ALUMINUM, total recoverable  7429905","N","N",750,87,null,null,null,null,null,"EPA 440/5-86-008"]
["AMMONIA  unionized -see seperate spreadsheets for FW criteria","N","N",null,null,"233","35",null,null,null,"WAC 173-201A"]
["ANTHRACENE  120127   3B","Y","N",null,null,null,null,9600,110000,null,"NTR"]
["ANTIMONY (INORGANIC)  7440360  1M","Y","N",9000,1600,null,null,14,4300,null,"NTR - HH"]
["ARSENIC (dissolved)  7440382  2M","Y","Y",360,190,69,36,null,null,null,"WAC 173-201A",1,1,1]
["ARSENIC  (inorganic)","Y","Y",null,null,null,null,1.7999999999999999E-2,0.14000000000000001,null,"NTR"]
["ARSENIC(PENT)","Y","Y",850,48,2319,13,null,null,null,"Gold Book"]
["ARSENIC(TRI)","Y","Y",360,190,69,36,null,null,null,"Gold Book"]
["ASBESTOS 1332214","Y","Y",null,null,null,null,"7000,000 fibers/L",null,null,"NTR-HH"]
["BACTERIA","N","N"," see document"]
["BARIUM  7440393","N","N",null,"EPA recommends 1 mg/L for drinking water",null,null,null,null,null,"Gold Book"]
["BENZENE 71432  3V","Y","Y",5300,null,5100,700,1.2,71,null,"Gold Book, NTR - HH"]
["BENZIDINE 92875  4B","Y","Y",2500,null,null,null,1.2E-4,5.4000000000000001E-4,null,"Gold Book, NTR - HH"]
["BENZO(a)ANTHRACENE  56553  5B","Y","Y",null,null,null,null,2.8E-3,3.1E-2,null,"NTR"]
["BENZO(a)PYRENE  50328  6B","Y","Y",null,null,null,null,2.8E-3,3.1E-2,null,"NTR"]
["BENZO(b)FLUORANTHENE  205992  7B","Y","Y",null,null,null,null,2.8E-3,3.1E-2,null,"NTR"]
["BENZO(k) FLUORANTHENE   207089  9B","Y","Y",null,null,null,null,2.8E-3,3.1E-2,null,"NTR"]
["BERYLLIUM  7440417  3M","Y","Y",130,5.3,null,null,null,null,null,"Gold Book"]
["BHC - ALPHA  319846   2P","Y","Y",100,null,0.34,null,3.8999999999999998E-3,1.2999999999999999E-2,null,"Gold Book, NTR - HH"]
["BHC - BETA  319857   3P","Y","Y",100,null,0.34,null,1.4E-2,4.5999999999999999E-2,null,"Gold Book, NTR - HH"]
["BHC - GAMMA  58899   4P (Lindane)","N","Y",2,0.08,0.16,null,1.9E-2,6.3E-2,null,"173-201A, NTR - HH"]
["BHC - DELTA  319868  5P","Y","Y",null,null,null,null,null,null,null,"no criteria available, substance listed on NPDES applic."]
["BIS(2-CHLOROETHYL)ETHER  111444   11B","Y","Y",null,null,null,null,3.1E-2,1.4,null,"NTR"]
["BIS(2 CHLOROISOPROPYL)ETHER  39638329  12B","Y","N",null,null,null,null,1400,170000,null,"NTR"]
["BIS(2-ETHYLHEXYL) PHTHALATE  117817  13B","Y","Y",940,3,2944,3.4,1.8,5.9,null,"Gold Book, NTR"]
["Boron"]
["BROMOFORM  75252  5V","Y","Y",null,null,null,null,4.3,360,null,"NTR"]
["BUTYLBENZYL PHTHALATE 85687",null,null,null,null,null,null,3000,5200,null,"FR 63, 237-HH"]
["CADMIUM - 7440439  4M        Hardness dependent","Y","N",{"$f":"(1.136672-((LN($B$239))*(0.041838)))*EXP(1.128*(LN($B$239))-3.828)","v":{"$error":"#NUM!"}},{"$f":"(1.101672-((LN($B$239))*(0.041838)))*EXP(0.7852*(LN($B$239))-3.49)","v":{"$error":"#NUM!"}},42,9.3000000000000007,null,null,null,"WAC 173-201A",0.94299999999999995,0.94299999999999995,0.99399999999999999,0.99399999999999999]
["Based on  hardness in next column",{"$f":"B203","v":0}]
["CARBON TETRACHLORIDE 56235   6V","Y","Y",35200," ",50000,null,0.25,4.4000000000000004,null,"Gold Book, NTR - HH"]
["CHLOROBENZENE  108907  7V","Y","N",null,null,null,null,680,21000,null,"NTR"]
["CHLORDANE 57749  6P","Y","Y","2.4","0.0043"," 0.09","0.004",5.6999999999999998E-4,5.9000000000000003E-4,null,"WAC 173-201A, NTR"]
["CHLORODIBROMOMETHANE  124481  8V","Y","Y",null,null,null,null,0.41,34,null,"NTR"]
["CHLORIDE (dissolved) in mg/L  16887006","N","N",860,230,null,null,null,null,null,"SEE WAC 173-201A FOOTNOTES"]
["2-CHLORONAPTHALENE  91587  16B","Y","N",1600,null,7.5,null,1700,4300,null,"Gold Book, FR 63, 237-HH"]
["CHLORINE  7782505","N","N",19,11,13,7.5,null,null,null,"WAC 173-201A"]
["CHLOROALKYL ETHERS","Y","N",238000,null,null,null,null,null,null,"Gold Book"]
["CHLOROETHYL ETHER (BIS - 2) 111444","Y","Y",null,null,null,null,3.1E-2,1.4,null,"NTR"]
["CHLOROFORM  67663  11V","Y","Y",28900,1240,null,null,5.7,470,null,"Gold Book, NTR - HH"]
["CHLOROISOPROPYL ETHER (BIS-2)  108601","Y","N",null,null,null,null,1400,170000,null,"NTR"]
["CHLOROMETHYL ETHER (BIS)","N","Y",null,null,null,null,3.76E-6,1.8400000000000001E-3,null,"Gold Book"]
["2-CHLOROPHENOL   95578   1A","Y","N",4380,2000,null,null,120,400,0.1,"Gold Book, FR 63, 237-HH"]
["4-CHLOROPHENOL  106489","N","N",null,null,29700,null,null,null,0.1,"Gold Book"]
["CHLOROPHENOXY HERBICIDES(2,4,5-TP)  93721","N","N",null,null,"10 in drinking water",null,null,null,null,"Gold Book"]
["CHLOROPHENOXY HERBICIDES(2,4-D)  94757","N","N",null,null,"100 in drinking water",null,null,null,null,"Gold Book"]
["CHLORPYRIFOS  2921882","N","N",8.3000000000000004E-2,4.1000000000000002E-2,1.0999999999999999E-2,5.5999999999999999E-3,null,null,null,"WAC 173-201A"]
["CHLORO-4METHYL-3 PHENOL","N","N",30,null,null,null,null,null,null,"Gold Book"]
["CHROMIUM(HEX)  18540299","Y","N",15,10,1100,50,null,null,null,"WAC 173-201A",0.98199999999999998,0.96199999999999997,0.99299999999999999,0.99299999999999999]
["CHROMIUM(TRI) -16065831  5M   Hardness dependent","N","N",{"$f":"(0.316)*EXP(0.819*(LN($B$260))+3.688)","v":{"$error":"#NUM!"}},{"$f":"(0.86)*EXP(0.819*(LN($B$260))+1.561)","v":{"$error":"#NUM!"}},10300,"NA",null,null,null,"WAC 173-201A, EXCEPT MARINE ACUTE"]
["Based on  hardness in next column",{"$f":"B203","v":0},null,null,null,null,null,null,null,null,null,0.316,0.86]
["CHRYSENE  218019   18B","Y","Y",null,null,null,null,2.8E-3,3.1E-2,null,"NTR"]
["COLOR","N","N","narrative statement see document"]
["COPPER - 744058  6M  Hardness dependent","Y","N",{"$f":"0.96*EXP(0.9422*(LN($B$264))-1.464)","v":{"$error":"#NUM!"}},{"$f":"(0.96)*EXP(0.8545*(LN($B$264))-1.465)","v":{"$error":"#NUM!"}},4.8,3.1,null,null,1000,"WAC 173-201A",{"$f":"IF(AND($B$202=0,$B$201=0),0.996, IF(AND($B$202=\"S\",$B$201<6.7), 1, IF(AND($B$202=\"s\", $B$201>=6.7),1.91*$B$201^ -0.341, IF(AND($B$202=\"a\", $B$201<11.4), 1, IF(AND($B$202=\"a\",$B$201>=11.4), 2.29*$B$201^ -0.341)))))","v":0.996},{"$f":"IF(AND($B$202=0,$B$201=0),0.996, IF(AND($B$202=\"s\",$B$201<6.7), 1, IF(AND($B$202=\"s\", $B$201>=6.7),1.91*$B$201^ -0.341, IF(AND($B$202=\"a\", $B$201<11.4), 1, IF(AND($B$202=\"a\",$B$201>=11.4), 2.29*$B$201^ -0.341)))))","v":0.996},0.83,0.83]
["Based on  hardness in next column",{"$f":"B203","v":0}]
["CYANIDE  57125  14M","Y","N",22,5.2,1,1,700,220000,null,"WAC 173-201A, NTR"]
["DDT  50293  7P","Y","Y",1.1000000000000001,1E-3,0.13,1E-3,5.9000000000000003E-4,5.9000000000000003E-4,null,"WAC 173-201A, NTR"]
["DDT METABOLITE (DDE)  72559  8P","Y","Y",1.1000000000000001,1E-3,0.13,1E-3,5.9000000000000003E-4,5.9000000000000003E-4,null,"WAC 173-201A, NTR"]
["DDT METABOLITE (DDD)  72548  9P","Y","Y",1.1000000000000001,1E-3,0.13,1E-3,8.3000000000000001E-4,8.4000000000000003E-4,null,"WAC 173-201A, NTR"]
["DEMETON","Y","N",null,0.1,null,0.1,null,null,null,"Gold Book"]
["DIBENZO(a,h)ANTHRACENE  53703   19B","Y","Y",null,null,null,null,2.8E-3,3.1E-2,null,"NTR"]
["DIBUTYLPHTHALATE 84742","Y","N",940,3,2944,3.4,2700,12000,null,"Gold Book, NTR - HH"]
["1,2 DICHLOROBENZENE 95501   20B","Y","N",1120,763,1970,null,2700,17000,null,"NTR - HH"]
["1,3 DICHLOROBENZENE  541731   21B","Y","N",1120,763,1970,null,400,2600,null,"NTR - HH"]
["1,4 DICHLOROBENZENE 106467   22B","Y","N",1120,763,1970,null,400,2600,null,"NTR - HH"]
["3,3 DICHLOROBENZIDINE 91941   23B","Y","Y",null,null,null,null,0.04,7.6999999999999999E-2,null,"NTR"]
["DICHLOROBROMOMETHANE  75274   12V","Y","Y",null,null,null,null,0.27,22,null,"NTR"]
["1,2 DICHLOROETHANE   107062   15V","Y","Y",118000,20000,113000,null,0.38,99,null,"Gold Book, NTR - HH"]
["1,1 DICHLOROETHYLENE  75354  16V","Y","Y",11600," ",224000," ",5.7000000000000002E-2,3.2,null,"Gold Book, NTR - HH"]
["2,3 DICHLOROPHENOL",null,null,null,null,null,null,null,null,0.04]
["2,4 DICHLOROPHENOL    1208312    2A              ","N","N",2020,365,null,null,93,790,0.3,"NTR - HH"]
["2,5 DICHLOROPHENOL",null,null,null,null,null,null,null,null,0.5]
["2,6 DICHLOROPHENOL",null,null,null,null,null,null,null,null,0.2]
["1,2 DICHLOROPROPANE  78875                  ","Y","N",23000,5700,10300,3040,0.52,39,null,"Gold Book, FR 63, 237-HH"]
["1,3 DICHLOROPROPENE  542756                   ","Y","N",6060,244,790,null,87,14100,null,"Gold Book"]
["1,3 -DICHLOROPROPYLENE  542756   18V","Y","N",null,null,null,null,10,1700,null,"NTR"]
["DIELDRIN   60571    10P                       ","Y","Y",2.5,1.9E-3,0.71,1.9E-3,1.3999999999999999E-4,1.3999999999999999E-4,null,"WAC 173-201A, NTR"]
["DIETHYLPHTHALATE  84662   24B","Y","N",940,3,2944,3.4,23000,120000,null,"Gold Book, NTR - HH"]
["2,4 DIMETHYLPHENOL    105679","Y","N",2120,null,null,null,540,2300,400,"Gold Book, FR 63, 237-HH"]
["DIMETHYLPHTHALATE  131113  25B","Y","N",940,3,2944,3.4,313000,2900000,null,"Gold Book, NTR - HH"]
["DI-n-BUTYL PHTHALATE  84742  26B","Y","N",null,null,null,null,2700,12000,null,"NTR"]
["2-METHYL-4,6 -DINITROPHENOL  534521  4A","Y","N",null,null,null,null,13.4,765,null,"NTR"]
["2,4-DINITROPHENOL  51285   5A","Y","N",null,null,null,null,70,14000,null,"NTR"]
["DINITROTOLUENE 2,4  121142  27B","Y","Y",330,230,590,370,0.11,9.1,null,"Gold Book, NTR - HH"]
["DINITROTOLUENE 2,6  606202  28B","Y","N",330,230,590,370,null,null,null,"Gold Book"]
["DINITRO-O-CRESOL 2,4","Y","N",null,null,null,null,13.4,765,null,"Gold Book"]
["DIOXIN (2,3,7,8-TCDD)  1746016","Y","Y",0.01,1.0000000000000001E-5,null,null,1.3000000000000001E-8,1.4E-8,null,"Gold Book, NTR - HH"]
["1,2 DIPHENYLHYDRAZINE   122667   30B","Y","Y",270,null,null,null,0.04,0.54,null,"Gold Book, NTR - HH"]
["DI-2-ETHYLHEXYLPHTHALATE  117817","Y","Y",940,3,2944,3.4,1.8,5.9,null,"WQC based on Gold Book values for phthalate esthers, HH-NTR"]
["ENDOSULFAN  a 959988   11P, b 33213659   12P","Y","N",0.22,5.6000000000000001E-2,3.4000000000000002E-2,"0.0087",0.93,2,null,"WAC 173-201A, NTR"]
["ENDOSULFAN SULFATE  1031078   13P","Y","N",null,null,null,null,0.93,2,null,"NTR"]
["ENDRIN  72208   14P","Y","N",0.18,2.3E-3,3.6999999999999998E-2,2.3E-3,0.76,0.81,null,"WAC 173-201A,  NTR "]
["ENDRIN ALDEHYDE  7421934   15P","Y","N",null,null,null,null,0.76,0.81,null,"NTR"]
["ETHYLBENZENE  100414   19V","Y","N",32000,null,430,null,3100,29000,null,"Gold Book, NTR - HH"]
["FLUORANTHENE  206440   31B","Y","N",3980,null,40,16,300,370,null,"Gold Book, NTR - HH"]
["FLUORENE  86737  32B","Y","N",null,null,null,null,1300,14000,null,"NTR"]
["GASSES, TOTAL DISSOLVED","N","N","see WAC 173-201A and the Gold Book"]
["GUTHION  86500","N","N",null,0.01,null,0.01,null,null,null,"Gold Book"]
["HALOETHERS","Y","N",380,122,null,null,0.19,15.7,null,"Gold Book"]
["HALOMETHANES","Y","Y",11000,null,12000,6400,null,null,null,"Gold Book"]
["HEPTACHLOR  76448   16P","Y","Y",0.52,3.8E-3,5.2999999999999999E-2,3.6000000000000003E-3,2.1000000000000001E-4,2.1000000000000001E-4,null,"WAC 173-201A, NTR"]
["HEPTACHLOR EPOXIDE  1024573   17P","Y","Y",0.52,3.8E-3,5.2999999999999999E-2,3.6000000000000003E-3,1E-4,1.1E-4,null,"WAC 173-201A, NTR"]
["HEXACHLOROBENZENE  118741   33B","Y","Y",null,null,null,null,7.5000000000000002E-4,7.6999999999999996E-4,null,"NTR - HH"]
["HEXACHLOROBUTADIENE  87683   34B","Y","Y",90,9.3000000000000007,32,null,0.44,50,null,"NTR - HH"]
["HEXACHLOROCYCLOHEXANE-ALPHA  319846  2P","Y","Y",null,null,null,null,3.8999999999999998E-3,1.2999999999999999E-2,null,"NTR"]
["HEXACHLOROCYCLOHEXANE-BETA  319857  3P","Y","Y",null,null,null,null,1.4E-2,4.5999999999999999E-2,null,"NTR"]
["HEXACHLOROCYCLOHEXANE-GAMMA (lindane)  58899  4P","Y","Y",2,0.08,0.16,"",1.9E-2,6.3E-2,null,"WAC 173-201A, NTR"]
["HEXACHLOROCYCLOHEXANE-DELTA  319868  5P","Y","Y",null,null,null,null,1.23E-2,4.1399999999999999E-2,null,"FR 63, 237-HH"]
["HEXACHLOROCYCLOPENTADIENE  77474  35B","Y","N",7,5.2,7,null,240,17000,1,"Gold Book, NTR - HH"]
["HEXACHLOROETHANE  67721   36B","N","Y",980,540,940,null,1.9,8.9,null,"Gold Book, NTR - HH"]
["INDENO(1,2,3-cd)PYRENE  193395   37B","Y","Y",null,null,null,null,2.8E-3,3.1E-2,null,"NTR"]
["IRON  7439896","N","N",null,1000,null,null,300,null,null,"Gold Book"]
["ISOPHORONE  78591","Y","Y",117000,null,12900,null,8.4,600,null,"Gold Book, NTR - HH"]
["LEAD -  7439921  7M  Dependent on hardness","Y","N",{"$f":"(1.46203-((LN($B$324))*(0.145712)))*EXP(1.273*(LN($B$324))-1.46)","v":{"$error":"#NUM!"}},{"$f":"(1.46203-((LN($B$324))*(0.145712)))*EXP(1.273*(LN($B$324))-4.705)","v":{"$error":"#NUM!"}},210,8.1,null,null,null,"WAC 173-201A, ",0.46600000000000003,0.46600000000000003,0.95099999999999996,0.95099999999999996]
["Based on  hardness in next column  c",{"$f":"B203","v":0}]
["MALATHION  121755","N","N",null,0.1,null,0.1,null,null,null,"Gold Book"]
["MANGANESE  7439965                             ","N","N",null,"See Gold Book",null,null,50,100,null,"FR 63, 237-HH"]
["2-METHYL-4-CHLOROPHENOL",null,null,null,null,null,null,null,null,1800]
["3-METHYL-4-CHLOROPHENOL  59507",null,null,null,null,null,null,null,null,3000]
["3-METHYL-6-CHLOROPHENOL",null,null,null,null,null,null,null,null,20]
["METHYL BROMIDE  74839   20V","Y","N",null,null,null,null,48,4000,null,"NTR"]
["METHYLENE CHLORIDE  75092   22V","Y","Y",null,null,null,null,4.7,1600,null,"NTR"]
["MERCURY  7439976   8M","Y","N",2.1,"0.012",1.8,2.5000000000000001E-2,0.14000000000000001,0.15,null,"WAC 173-201A, NTR - HH",0.85,null,0.85]
["METHOXYCHLOR","N","N",null,0.03,null,0.03,100,null,null,"Gold Book"]
["MIREX  2385855","N","N",null,1E-3,null,1E-3,null,null,null,"Gold Book"]
["MONOCHLOROBENZENE  108907","Y","N",null,"See Chlorobenzene",null,null,null,null,20]
["NAPHTHALENE   91203   39B","Y","N",2300,620,2350,null,null,null,null,"Gold Book"]
["NICKEL - 7440020    9M   -  Dependent on hardness","Y","N",{"$f":"(0.998)*(EXP(0.846*(LN($B$338))+3.3612))","v":{"$error":"#NUM!"}},{"$f":"(0.997)*(EXP(0.846*(LN($B$338))+1.1645))","v":{"$error":"#NUM!"}},74,8.1999999999999993,610,4600,null,"WAC 173-201A, NTR",0.998,0.997,0.99,0.99]
["Based on  hardness in next column",{"$f":"B203","v":0}]
["NITROBENZENE  98953   40B","Y","N",27000,null,6680,null,17,1900,30,"Gold Book, NTR - HH"]
["2-NITROPHENOL  88755","Y","N",230,150,4850,null,null,null,null,"Gold Book"]
["NITRATE/NITRITE (N)","N","N",null,"See Gold Book",null,null,10000,null,null,"Gold Book"]
["NITROSAMINES","Y","Y",5850,null,3300000,null,8.0000000000000002E-3,1.24,null,"Gold Book, FR 63, 237-HH"]
["NITROSODIBUTYLAMINE N  924163","Y","Y",null,"See Gold Book",null,null,6.4000000000000003E-3,0.58699999999999997,null,"FR 63, 237-HH"]
["NITROSODIETHYLAMINE, N  55185","Y","Y",null,"See Gold Book",null,null,8.0000000000000004E-4,1.24,null,"FR 63, 237-HH"]
["NITROSODIMETHYLAMINE N  62759   41B","Y","Y",null,null,null,null,6.8999999999999997E-4,8.1,null,"NTR"]
["N- NITROSODI-N-PROPYLAMINE  621647",null,null,null,null,null,null,5.0000000000000001E-3,1.4,null,"FR 63, 237-HH"]
["NITROSODIPHENYLAMINE N  86306   43B","Y","Y",null,null,null,null,5,16,null,"NTR"]
["NITROSOPYRROLIDINE, N  930552","Y","Y",null,"See Gold Book",null,null,1.6E-2,91.9,null,"FR 63, 237-HH"]
["OIL AND GREASE","N","N",null,"See Gold Book and EPA 440/9-76-023",null,null,null,null,null," "]
["OXYGEN DISSOLVED  7782447","N","N",null,"See WAC 173-201A"]
["PARATHION  56382","N","N",6.5000000000000002E-2,1.3000000000000001E-2,null,null,null,null,null,"WAC 173-201A, "]
["PENTACHLOROBENZENE  608935","N","N",null,"See Gold Book",null,null,3.5,4.0999999999999996,null,"FR 63, 237-HH"]
["PENTACHLOROPHENOL   87865    8A   (pH dependent in","Y","Y",{"$f":"EXP(1.005*($B$354)-4.83)","v":20.267122665635235},{"$f":"EXP(1.005*($B$354)-5.29)","v":12.794303080298258},"13.",7.9,0.28000000000000003,8.1999999999999993,30,"WAC 173-201A, NTR"]
["fresh water)    Enter pH  in next cell>>>>>>>>",7.8]
["pH","N","N",null,"6.5 - 8.5",null,"7.0 - 8.5",null,null,null,"WAC 173-201A, "]
["PHENOL  108952   10A","Y","N",10200,2560,5800,null,21000,4600000,300,"Gold Book, NTR - HH"]
["PHOSPHORUS-ELEMENTAL  7723140","N","N",null,null,null,0.1,null,null,null,"Gold Book"]
["Polychlorinated Biphenyls (PCB's)  53469219, 11097691, 1104282, 11141165, 12672296, 11096825, 12674112    18P-24P","Y","Y",2,1.4E-2,10,0.03,1.7000000000000001E-4,1.7000000000000001E-4,null,"WAC 173-201A, NTR "]
["POLYNUCLEAR AROMATIC HYDROCARBONS","Y","Y",null,null,300,null,2.8E-3,3.1099999999999999E-2,null,"Gold Book"]
["PYRENE  129000   45B","Y","N",null,null,null,null,960,11000,null,"NTR"]
["SELENIUM   7782492  10M","Y","N",20,5,290,71,170,11000,null,"WAC 173-201A, FR 63, 237-HH"]
["SILVER -  7740224  11M dependent on hardness. ","Y","N",{"$f":"0.85*EXP(1.72*(LN($B$363))-6.52)","v":{"$error":"#NUM!"}},"NA",1.9,"NA",null,null,null,"SEE WAC 173-201A, acute level not",0.85,null,0.85]
["Based on  hardness in next column",{"$f":"B203","v":0},null,null,null,null,null,null,null,null,"to be exceeded at any time"]
["SOLIDS,DISSOLVED AND SALINITY","N","N",null,"See Gold Book",null,null,250000,"FR 63, 237-HH"]
["SOLIDS,SUSPENDED AND TURBIDITY","N","N",null,"See EPA 440/9-76-023 and WAC 173-201A",null,null,null,null,null,"FR 63, 237-HH"]
["SULFIDE, HYDROGEN SULFIDE  7783064","N","N",null,2,null,2,null,null,null,"FR 63, 237-HH"]
["TETRACHLORINATED ETHANES","Y","N",9320,null,null,null,null,null,null,"Gold Book"]
["TETRACHLOROBENZENE 1,2,4,5   95943","Y","N",null,"See Gold Book",null,null,2.2999999999999998,2.9,null,"FR 63, 237-HH"]
["TETRACHLOROETHANE 1,1,2,2   79345  23V","Y","Y",null,2400,9020,null,0.17,11,null,"Gold Book, NTR - HH"]
["TETRACHLOROETHANE                   ","Y","N",9320,null,null,null,null,null,null,"Gold Book"]
["TETRACHLOROETHYLENE   127184  24V","Y","Y",5280,840,10200,450,0.8,8.85,null,"Gold Book, NTR - HH"]
["TETRACHLOROPHENOL 2,3,4,6   95954",null,null,null,null,null,null,2600,9800,1,"FR 63, 237-HH"]
["TETRACHLOROPHENOL 2,3,5,6","Y","N",null,null,440,null,null,null,null,"Gold Book"]
["THALLIUM  7440280   12M","Y","N",1400,40,2130,null,1.7,6.3,null,"Gold Book, NTR - HH"]
["TOLUENE  108883   25V","Y","N",17500,null,6300,5000,6800,200000,null,"Gold Book, NTR - HH"]
["TOXAPHENE  8001352   25P","Y","Y",0.73,2.0000000000000001E-4,0.21,2.0000000000000001E-4,7.2999999999999996E-4,7.5000000000000002E-4,null,"WAC 173-201A,   NTR "]
["1,2-TRANS-DICHLOROETHYLENE  156605",null,null,null,null,null,null,700,140000,null,"FR 63, 237-HH"]
["TRIBUTYLTIN (TBT)",null,null,0.46,6.3E-2,0.37,0.01,null,null,null,"Proposed 62 FR 42554 8/97"]
["TRICHLOROBENZENE 1,2,4   120821",null,null,null,null,null,null,260,940,null,"FR 63, 237-HH"]
["TRICHLORINATED ETHANES","Y","Y",18000,null,null,null,null,null,null,"Gold Book"]
["TRICHLOROETHANE 1,1,1   71556   27V","Y","N",null,null,31200,null,18400,1030,null,"Gold Book"]
["TRICHLOROETHANE 1,1,2  79005   28V","Y","Y",null,9400,null,null,0.6,42,null,"Gold Book, NTR - HH"]
["TRICHLOROETHYLENE  79016   29V","Y","Y",45000,21900,2000,null,2.7,81,null,"Gold Book, NTR - HH"]
["TRICHLOROPHENOL 2,4,5  95954","N","N",null,"See Gold Book",null,null,null,null,1]
["TRICHLOROPHENOL 2,4,6   88062  11A","Y","Y",null,970,null,null,2.1,6.5,2,"Gold Book, NTR - HH"]
["VINYL CHLORIDE  75014   31V","Y","Y",null,null,null,null,2,525,null,"NTR"]
["ZINC-  7440666   13M hardness dependent","Y","N",{"$f":"0.978*EXP(0.8473*(LN($B$388))+0.8604)","v":74.239216782934918},{"$f":"0.986*EXP(0.8473*(LN($B$388))+0.7614)","v":67.79166302762313},90,81,null,null,5000,"WAC 173-201A, ",{"$f":"IF(AND($B$202=0,$B$201=0),0.996, IF(AND($B$202=\"s\",$B$201<4.9), 1, IF(AND($B$202=\"s\", $B$201>=4.9),1.44*$B$201^ -0.231, IF(AND($B$202=\"a\", $B$201<12.5), 1, IF(AND($B$202=\"a\",$B$201>=12.5), 1.79*$B$201^ -0.231)))))","v":0.996},{"$f":"IF(AND($B$202=0,$B$201=0),0.996, IF(AND($B$202=\"s\",$B$201<4.9), 1, IF(AND($B$202=\"s\", $B$201>=4.9),1.44*$B$201^ -0.231, IF(AND($B$202=\"a\", $B$201<12.5), 1, IF(AND($B$202=\"a\",$B$201>=12.5), 1.79*$B$201^ -0.231)))))","v":0.996},0.94599999999999995,0.94599999999999995]
[null,{"$f":"B6","v":60}]
[]
[]
[]
[]
[]
[]
[]
[]
[]
[]
[]
[]
["* = INSUFFIFIENT DATA TO DEVELOP CRITERIA VALUE"]
["PRESENTED IS TH L.O.E.L- LOWEST OBSERVED"]
["< Click \"+\" to see the other pollutants which can be pasted to the upper portion of the spreadsheet if they become pollutants of concern."]

{"sheet":"Non-Conservative","index":4,"n_rows":32,"n_cols":3,"rows_kept":32,"cut":false,"hidden":false,"merged":[]}
[null,null,"ADJUSTMENTS TO THE LOCLIMIT.XLS SPREADSHEET FOR NON-CONSERVATIVE POLLUTANTS"]
[]
[null,"Make Changes in","FOR THE CASE OF:"]
[null,"Spreadsheet","POLLUTANTS FOR WHICH WATER QUALITY STANDARDS EXIST:"]
[1,"BasicData","Enter basic data as for conservative pollutants and names of pollutants in lines 62-65 (make additional lines if needed)"]
[2,"BasicData","Collect monitoring data and choose to calculate limits (lines 35-39) using actual data"]
[3,"Sample Data","Input sampling data in column U - X (clean sample methods may be needed for effluent and ambient samples)"]
[4,"Sample Data","To give all loadings to industries, input a value in row 10 equal to the ave Influent concentration (row 3) * BasicData cells C24 / C26 "]
[5,"POTW Limits","Enter WQ Criteria in rows 29-32 if criteria for the pollutants exist in the table in the lower part of that spreadsheet"]
[6,"Local Limits","Enter 'Y' to using site specific sample data in rows 50 and 53 for these specific pollutants (if this is not the default for all pollutants)"]
[7,"Local Limits","Find the column for the pollutant (T-W) and enter \"NA\" in rows 27-30 and 60-62 for inhibition thresholds and sludge criteria unless these exist."]
[8,"Local Limits","Adjust presumptions as necessary to obtain results (not all cells will automatically recognize when their calculation is not applicable)"]
[]
[null,null,"IF NO SAMPLING EXISTS, use of this spreadsheet should be confirmed after data exists, but you can estimate a limit if you: "]
[1,"LOCLIMIT.xls","Estimate the removal rate and input as the \"Reference Ave Plant Removal\" in LOCLIMIT.xls row 46 (under the appropriate column)"]
[null,null,"(This removal rate is the ratio of effluent to influent after biodegradation, volatization, and sludge partitioning)"]
[2,"BasicData.xls","Only change settings in the \"BasicData\" lines 35 and 38 to \"N\" if no monitoring data exists for any pollutant"]
[null,"LOCLIMIT.xls","Otherwise enter \"N\" in Local Limits rows 50 and 53 under the column for this pollutant to indicate that monitoring data does not exist."]
[3,"(continue as above)","Continue from step 5 as for pollutants for which WQ standards exist (above) "]
[null," "]
[null,"Spreadsheet","POLLUTANTS THAT HAVE EXPLOSIVE OR TOXIC VAPORS:"]
[1,"Toxic-Explosive","List Pollutants of potential concern (usually from IU Survey or Permit Applications) in the \"Summary Table\" in Toxic-Explosive Limits tab"]
[2,"Toxic-Explosive","Calculate toxicity and explosivity limits (or read them from the included tables TE-1 or TE-2) in the \"Toxic-Explosive Limits\" sheet"]
[3,"Toxic-Explosive","Typically the lower of the explosivity or vapor toxicity thresholds should be the local limit.  This may be increased (steps 3 on) if:"]
[null,null,"If there are diluting flows before the nearest point of concern do a flow proportionate weighting to increase the limit by that proportion. "]
[null,"Toxic-Explosive","First, in the same manner, determine the limiting concentration using the \"Toxic-Explosive.xls\" worksheet"]
[null,null,"Then multiply this value by the ratio of total flows / flows which contain the pollutant"]
[null,"Toxic-Explosive","Put the resulting value (and a footnote explaining the rationale) in the summary table in the \"Toxic-Explosive Limits\" tab"]
[]
[]
[" "]
[" "]

{"sheet":"Conventional Poll Tool","index":5,"n_rows":37,"n_cols":8,"rows_kept":37,"cut":false,"hidden":false,"merged":[[23,1,23,4],[22,1,22,4],[31,1,31,4],[32,1,32,4],[33,1,33,4],[24,1,24,4],[25,1,25,4],[29,1,29,4],[30,1,30,4],[21,1,21,4],[12,1,12,4],[13,1,13,4],[14,1,14,4],[15,1,15,4],[16,1,16,4]]}
[]
[]
[null,"Conventional Pollutant Management Tables:"]
[null,null,null,null,"CHECK OF DESIGN CAPACITY:"]
[null,null,null,null,"MMA Oxygen Delivery Capacity of the POTW: ",null,"<- Calculations not included here - redundancy requirements apply"]
[null,null,null,null,"Design MMA loading of BOD5:",null,"<- MMA = Maximum Monthly Average"]
[null,null,null,null,"Conversion Factor lb O2/lb BOD:"]
[null,null,null,null,"Design MMA loading of Ammonia (as N):"]
[null,null,null,null,"Conversion Factor lb O2/lb Ammonia (as N)"]
[null,null,null,null,"Percentage of Oxygen Capacity Used:",{"$f":"(F6*F7+F8*F9)/F5","v":{"$error":"#DIV/0!"}}]
[null,null,null,null,null,null,null,"Next Upgrade"]
[null,"BOD LOAD ALLOCATION TABLE:",null,null,null,"CURRENT","DESIGN","FUTURE"]
[null,"Total BOD Loading Available:"]
[null,"BOD Loading for Domestic Sources:"]
[null,"BOD Loading allocation for Commercial:"]
[null,"BOD Loading for Significant Industries"]
[null,"BOD Loading in reserve for domestic"]
[null,"BOD loading in reserve SIU's"]
[]
[]
[null,"TSS LOAD ALLOCATION TABLE:",null,null,null,"CURRENT","DESIGN","FUTURE"]
[null,"Total TSS Loading Available:"]
[null,"TSS Loading for Domestic Sources:"]
[null,"TSS Loading allocation for Commercial:"]
[null,"TSS Loading for Significant Industries"]
[null,"TSS Loading in reserve for domestic"]
[null,"TSS Loading in reserve for SIU's"]
[]
[null,"AMMONIA LOAD ALLOCATION TABLE:",null,null,null,"CURRENT","DESIGN","FUTURE"]
[null,"Total Ammonia Loading Available:"]
[null,"Ammonia Loading for Domestic Sources:"]
[null,"Ammonia Loading allocation for Commercial:"]
[null,"Ammonia Loading for Significant Industries"]
[null,"Ammonia Loading in reserve for domestic"]
[null,"Ammonia Loading in reserve for SIU's"]
[]
[null,"STRATEGY: "]

{"sheet":"Toxic-Explosive Limits","index":6,"n_rows":322,"n_cols":13,"rows_kept":322,"cut":false,"hidden":false,"merged":[[273,3,275,3]]}
[null,null,null,null,null,null,null,null,"HANDY CONVERSION TABLES"]
[]
[null,null,null,"Spreadsheet for calculating vapor toxicity and explosivity screening levels",null,null,null,null,"Using Henry's from .pdf file:","Method to convert from: KHCP"]
[null,null,null,"The Henry's Law Constant is abbreviated as H in this worksheet",null,null,null,null,"Table CONV1 - Compound:","Methyl Bromide","(fill in)"]
[null,null,null,null,null,null,null,null,"Henry's # in units in .pdf file",4.4000000000000003E-3,"(research to find)"]
[null,null,"Summary Table","Explosivity Screening LVL","Vapor Toxicity Limit","0.1*LEL","Proposed Limit",null,"Molar Weight ",94.94,"(research to find)"]
[null,null,"Pollutant:","Max. Disch. Conc.","From table TE-1","From table TE-1&2",null,null,"Henry's # in units for vapor Toxicity",{"$f":"40.9/J5","v":9295.4545454545441}]
[null,null,null,null,null,null,null,null,"Henry's # in units for Explosivity",{"$f":"0.0409/(J5*J6)","v":9.790872704291706E-2}]
[]
[null,null,null,null,null,null,null,null,"Translation Table: H vapor <> H explosivity:"]
[null,null,null,null,null,null,null,null,"Table CONV2: Compound M.W. = ",94.94,"(research to find)"]
[null,null,null,null,null,null,null,null,"Given H in Units for vapor Toxicity:",9295,"(research to find)"]
[null,null,null,null,null,null,null,null,"Equiv. H in Units for Explosivity",{"$f":"J12/(J11*1000)","v":9.7903939330103218E-2}]
[null,null,null,null,null,null,null,null,"Given H in Units for Explosivity:",9.7900000000000001E-2,"(research to find)"]
[null,null,null,null,null,null,null,null,"Equiv. H in Units for Toxicity:",{"$f":"J14*1000*J11","v":9294.6260000000002}]
[]
[null,null,null,null,null,null,null,null,"Explosivity from LEL%:"]
[null,null,null,null,null,null,null,null,"Table CONV3 - Compound:","Methyl Bromide","(complete)"]
[null,null,null,null,null,null,"(Note, these limits are",null,"Explosivity: LEL% in air",10,"(research to find)"]
[null,null,null,null,null,null,"based on the effect where",null,"Henry's law constant:",9.7900000000000001E-2,"(research to find)"]
[null,null,null,null,null,null,"discharged not the load at",null,"C(vapor) - mol/m3",{"$f":"0.0409*J19","v":0.40899999999999997}]
[null,null,null,null," ",null,"the headworks)",null,"RESULTANT Aqueous LEL:",{"$f":"J21/J20","v":4.1777323799795703},"in water"]
[]
[null,null,null,"Air Density @70F=1.20kg/m3",null,null,null,null,"Vapor - from mg/m3 std:"]
[null,null,null,"Air Density @stp = 1.29kg/m3",null,null,null,null,"Table CONV4 - Compound:","Methyl Bromide","(complete)"]
[null,null,null,"Molal air volume=22.4 m3/mol at STP",null,null,null,null,"ACGIH TLV-TWA (w/v)",19.46,"(research to find)"]
[null,null,null,"1 mol/atm = 24.46 aq/gas",null,null,null,null,"Henry's law constant:",9295,"(research to find)"]
[null,null,null,null,null,null,null,null,"Gas-Vapor Screening Level:",{"$f":"J26/J27","v":2.0935987089833246E-3},"in water"]
[null,null,"How to find the water concentration that leads to equilibrium air concentrations of concern"]
[null,"Step 1","Identify potential pollutants of concern (based on pollutants used at IUs)",null,null,null,null,null,"Table CONV5 - Compound:","Methyl Bromide","(complete)"]
[null,"Step 2","Identify relevant criteria:  For Henry's levels, use references",null,null,null,null,null,"ACGIH TLV-TWA (v/v)",5,"(research to find)"]
[null,null,"For fume toxicity: use WA Standards (WA-OSHA-STDS tab) for exposure.",null,null,null,null,null,"Molar Weight",94.94,"(research to find)"]
[null,null,"For Explosivity find the Lower Explosive Limit (LEL) and use 10% of the LEL for screening",null,null,null,null,null,"Henry's law constant:",9295,"(research to find)"]
[null,"Step 3","Find the corresponding IU discharge screening level for vapor toxicity",null,null,null," ",null,"Equivalent TLV-TWS (w/v)",{"$f":"0.041*(J31*J32)","v":19.462700000000002}]
[null,null,"The Gas/Vapor Toxicity screening level = (Vapor Toxicity level) / (Henry's Law Constant)  ",null,null,null,null,null,"Gas-Vapor Screening Level:",{"$f":"J34/J33","v":2.0938891877353418E-3},"in water"]
[null,null,"Convert units for Vapor Toxicity into \"mg/m3\" and the Henry's Law Constant into \"(mg/m3)/(mg/L)\""]
[null,"Step 4","Find the explosivity screening level = X% * Critical Vapor Concentration / Henry's Law Constant",null,null,null,null,null,"Using Henyr's in RREL TDB:"]
[null,null,"Critical Vapor Concentration\"C(vapor)\" is in mol/m3 & Henry's Law Constant is in \"(mol/m3)/(mg/L)\"",null,null,null,null,null,"Table CONV6 - Compound:","Octane","(complete)"]
[null,null,"EPA Recommends:  X% be 10% (or a multiplier of 0.1 times the LEL).",null,null,null,null,null,"RREL TDB Value:",3.21,"(research to find)"]
[null,"Step 5","Compare the more stringent screening level to current \"end of pipe\" discharge levels",null,null,null,null,null,"Molar Weight",114.23,"(research to find)"]
[null,"Step 6","Codify limits if more than one user likely to discharge, otherwise, include in specific permit",null,null,null,null,null,"Table TE-2 Column G Value",{"$f":"1/(J39*1000)","v":3.1152647975077883E-4}]
[null,"NOTE:  The Henry's law constant in Table TE-1, column H is appropriate for calculating gas/vapor toxicity.  ",null,null,null,null,null,null,"Explosivity Henry's Number:",{"$f":"0.0409/(J41*J40)","v":1.1493390527882341}]
[null,"Use Table CONV2 and MW to translate this to a Henry's Law Constant useful for calculating Explosivity Screening level",null,null,null,null,null,null,"Vapor Toxicity Henry's Number",{"$f":"40.9/J41","v":131289}]
[null,"T = Temperature -- For purposes of this spreadsheet this is assumed to be constant 25C "]
[null,"Significant deviations from 25C temperature will require a temperature adjustment (see more detailed analysis methods)"]
[]
[null,null,"Example:  Limit based on Explosivity ",null,null,"Note: "]
[null,null,"Identify pollutant of concern",null,"Chlorobenzene","Identified from industrial surveys or permit applications"]
[null,null,"Determine LEL",null,1.4E-2,"From table above - note use as fraction when cancelling units -- two orders of magnitude difference"]
[null,null,"Calculate screening conc",null,{"$f":"0.04087*E49*100","v":5.7217999999999991E-2},"LEL% * .04087 (@25C)"]
[null,null,"Determine Henry's const",null,0.32,"From literature (or table above)"]
[null,null,"Determine Molar Wt.",null,112.45,"From literature (or table above)"]
[null,null,"Convert Henry's const",null,{"$f":"0.04087/(E52*E51)","v":1.1357825700311248E-3},"~ .04087/(MW * H in mol/atm)"]
[null,null,"Calculate screening level",null,{"$f":"E50/E53","v":50.377599999999994},"~ Cvap / H"]
[null,null,"  (alternate formula:)",null,{"$f":"0.1*1000*E49*E51*E52","v":50.377600000000008},"10%*LEL*MW*Khcp*1000L/m3"]
[null,null,"Compare to effluent level",null,12.4,"From samples or permit app"]
[null,null,"Establish limit?",null,"Yes","Can use \"reaspot\" spreadsheet from Ecology -- Consider all explosive parameters as additive through"]
[]
[null,null,"EXAMPLE TABLES (Vapor Toxicity in Table TE-1, Explosivity in Table TE-2)",null,null,null,"H > 1*ee-4 atm*m3/mol = volatile"]
[null,null,"SELECTED POLLUTANT TOXICITY AND EXPLOSIVITY DATA:",null,null,null,"(From EPA's 1992 Manual)","H > 4.1 (mg/m3)/(mg/L) = volatile"]
[null,null,"TABLE TE-1",null,"EPA Published ","Explosivity","Calc'd Gas/Vapor","Vapor Toxicity Limit","Henry's Law Constant","Vapor Threshold","Molar","Equivalent"]
[null,null,"CAS#","Compound Name:","Gas/Vapor Toxicity ","Screening ","Toxicity screening lvl","TLV-TWA or STEL","expressed as","TLV-TWA","Weight","TLV-TWS"]
[null,null,"(add if desired)","(most common in yellow)","Screening lvl(1)","Level mg/L","Basis = WA State law ","mg/m3","(mg/m3)/(mg/L)","in PPM by volume","of Pollutant","mg/m3"]
[null,null,null,"Acenapthalene",null,null,null,null,60.3]
[null,null,null,"Acetone",null,null,{"$f":"L65/I65","v":787.41721854304637},{"$f":"L65","v":1189},1.51,500,58,{"$f":"0.041*(K65*J65)","v":1189}]
[null,null,null,"Acetonitrile",null,null,null,null,null,2,41.05,3.3660999999999999]
[null,null,null,"Acrolein",null,null,{"$f":"L67/I67","v":4.5920000000000002E-2},{"$f":"L67","v":0.22960000000000003},5,0.1,56,0.22960000000000003]
[null,"l",null,"Acrylonitrile",1.19,1794,{"$f":"L68/I68","v":1.2005524861878454},4.3,3.62,2,53,4.3460000000000001]
[null,"l",null,"Aldrin",0.38,null,{"$f":"L69/I69","v":5.7541923076923078},0.25,0.65,0.25,364.9,3.7402250000000001,"(STEL=.75, TWA=.25)"]
[null,null,null,"Ammonia",null,null,{"$f":"L70/I70","v":26.007462686567163},{"$f":"L70","v":17.425000000000001},0.67,25,17,17.425000000000001]
[null,null,null,"Anthracine",null,null,null,null,51.1]
[null,"l",null,"Benzene",0.13,20,7.1166888888888891E-2,32,225,5,78.11,{"$f":"0.041*(K72*J72)","v":16.012550000000001},"(State stds 5 ppm STEL)"]
[null,null,null,"Bis(2-chloromethyl) ether",5.0000000000000001E-4,null,null,4.4000000000000003E-3,8.58]
[null,"l",null,"Bromoform",0.24,null,0.23549840909090908,5.2,22,0.5,252.73,{"$f":"0.041*(K74*J74)","v":5.1809649999999996}]
[null,null,null,"Bromomethane",2E-3,4.7,null,20,8189,null,94.94]
[null,null,null,"Carbon Dioxide",null,null,7.4979218620116379,{"$f":"L76","v":9020},1203,5000,44,{"$f":"0.041*(K76*J76)","v":9020}]
[null,"l",null,"Carbon Disulfide",0.06,6.3,7.6450775510204086E-2,31,490,12,76.14,{"$f":"0.041*(K77*J77)","v":37.460880000000003},"(state std 15 minute STEL)"]
[null,"l",null,"Carbon Tetrachloride",0.03,null,1.3193765690376568E-2,31,956,2,153.82,{"$f":"0.041*(K78*J78)","v":12.613239999999999},"(state TLV-TWA 8-hr std = 2)"]
[null,"l",null,"Chlordane",{"$f":"H79/I79","v":1.2820512820512819},null,null,0.5,0.39,null,409.78]
[null,null,null,"Chlorine",null,null,3.6387500000000001E-3,{"$f":"L80","v":0.72775000000000001},200,0.5,35.5,{"$f":"0.041*(K80*J80)","v":0.72775000000000001}]
[null,"l",null,"Chlorobenzene",2.31,40,2.3229664429530201,345,149,75,112.56,{"$f":"0.041*(K81*J81)","v":346.12200000000001}]
[null,null,null,"Chloroethane",5.73,1.6,null,2600,6152,null,64.510000000000005]
[null,"l",null,"Chloroform",0.41,null,8.1555833333333327E-2,49,120,2,119.35,{"$f":"0.041*(K83*J83)","v":9.7866999999999997}]
[null,null,null,"Chloromethane",0.28999999999999998,1.1000000000000001,null,103,372,null,50.49]
[null,"l",null,"1,2 Dichlorobenzene",3.75,165,3.757481296758105,301,80.2,50,147,{"$f":"0.041*(K85*J85)","v":301.35000000000002}]
[null,null,null,"1,3 Dichlorobenzene",null,null,null,null,148,null,147]
[null,"l",null,"1,4 Dichlorobenzene",3.55,104,{"$f":"L87/I87","v":5.2202362204724411},451,127,110,147,662.97]
[null,"l",null,"Dichlorodifluoromethane",0.04,null,{"$f":"L88/I88","v":3.4644378945985669E-4},4950,121801,10,102.92,42.197200000000002,"(STEL)"]
[null,"l",null,"1,1 Dichloroethane",4.58,128,{"$f":"L89/I89","v":2.2909039548022601},810,177,100,98.9,{"$f":"0.041*(K89*J89)","v":405.49}]
[null,null,null,"trans-,2-Dichloroethylene (1,2-Dithloroethylene)",0.28000000000000003,14,{"$f":"H90/I90","v":0.28473967684021545},793,2785,null,96.94]
[null,null,null,"1,2-Dichloropropane",3.62,164,{"$f":"L91/I91","v":3.6163281250000003},347,96,75,112.9,{"$f":"0.041*(K91*J91)","v":347.16750000000002}]
[null,"l",null,"1,3-Dichloropropene",0.08,435,8.1374321880650996E-2,4.5,55.3,null,110.97]
[null,"l",null,"Dieldrin",13,null,12.5,0.25,0.02,null,380.91]
[null,null,null,"Diethyl amine",null,null,{"$f":"L94/I94","v":48.274193548387096},{"$f":"L94","v":14.965},0.31,5,73,{"$f":"0.041*(K94*J94)","v":14.965}]
[null,"l",null,"Diethyl phthalate",107,null,100,5,0.05,null,222.24]
[null,"l",null,"4,6-Dinitro-o-cresol",10.78,null,3.3333333333333335,0.2,0.06,null,198.13]
[null,"l",null,"Dinitrotoluene",7.21,null,7.1428571428571432,1.5,0.21,null,182.13]
[null,"l",null,"Endrin",{"$f":"H98/I98","v":5},null,5,0.1,0.02]
[null,"l",null,"Ethyl Benzene",1.59,16,{"$f":"L99/I99","v":1.9826642335766422},434,274,125,106,{"$f":"0.041*(K99*J99)","v":543.25},"(STEL = 125, TLV-TWA = 100)"]
[null,null,null,"Ethylene Dichloride",1.05,660,{"$f":"L100/I100","v":0.21052631578947367},40,38,null,null,8]
[null,"l",null,"Formaldehyde",{"$f":"H101/I101","v":0.12019230769230768},412,{"$f":"L101/I101","v":0.11826923076923077},2.5,20.8,2,30,{"$f":"0.041*(K101*J101)","v":2.46},"(STEL = 2, TLV = .75)"]
[null,null,null,"Gluteraldehyde 111-30-8",null,null,{"$f":"L102/I102","v":18.325535714285717},0.8,4.48E-2,0.2,100.12,{"$f":"0.041*(K102*J102)","v":0.82098400000000005}]
[null,"l",null,"Heptachlor",3.0000000000000001E-3,null,{"$f":"L103/I103","v":3.0674846625766872E-3},0.5,163,null,null,0.5]
[null,"l",null,"Hexachloro-1,3 butadiene",2.0000000000000001E-4,null,1.9736842105263157E-4,0.21,1064]
[null,"l",null,"Hexachloroethane",0.93,null,9.3269230769230757E-2,9.6999999999999993,104]
[null,"l",null,"Hexachloropentadiene",658,null,137.5,0.11,8.0000000000000004E-4]
[null,null,null,"Hexane",null,null,3.3190880509064895E-3,{"$f":"L107","v":176.3},53117,50,86,{"$f":"0.041*(K107*J107)","v":176.3}]
[null,null,null,"Hydrogen Sulfide",null,null,3.4083129584352084E-2,{"$f":"L108","v":13.940000000000001},409,10,34,{"$f":"0.041*(K108*J108)","v":13.940000000000001}]
[null,null,null,"Methyl alcohol",{"$f":"H109/I109","v":1382.7789473684211},null,1382.7789473684211,{"$f":"L109","v":262.72800000000001},0.19,200,32.04,{"$f":"0.041*(K109*J109)","v":262.72800000000001}]
[null,null,null,"Methyl Bromide",{"$f":"H110/I110","v":2.0941144824618034E-3},null,2.0941144824618034E-3,{"$f":"L110","v":19.462700000000002},9294,5,94.94,{"$f":"0.041*(K110*J110)","v":19.462700000000002}]
[null,null,null,"Methyl ethyl ketone",249,2486,248.94514767932489,590,2.37,300,{"$f":"L111/(0.041*J111)","v":71.951219512195124},885,"(STEL = 300, TLV = 200)"]
[null,"l",null,"Methyl Chloride",{"$f":"H112/I112","v":0.1167964404894327},null,{"$f":"L112/I112","v":5.7566462736373752E-2},210,1798,50,50.49,{"$f":"0.041*(K112*J112)","v":103.50450000000001}]
[null,"l",null,"Methylene Chloride",2.06,494,{"$f":"L113/I113","v":5.1571830568720376},434,84.4,125,84.93,{"$f":"0.041*(K113*J113)","v":435.26625000000001},"(STEL=125, TLV=25)"]
[null,"l",null,"Napthalene",null,240,2.6503567787971458,52,19.62]
[null,"l",null,"Nitrobenzene",null,17046,{"$f":"L115/I115","v":1.8867924528301885},5,0.53,null,null,1,"(TLV-TWA)"]
[null,null,null,"Penatchloroethane",null,null,null,null,88.7]
[null,null,null,"Pentachlorophenol",9.41,null,4.5454545454545459,0.5,0.11,null,null,0.5,"(TLV-TWA)"]
[null,"l",null,"Phenol",{"$f":"H118/I118","v":950},null,{"$f":"L118/I118","v":963.5},19,0.02,5,94,{"$f":"0.041*(K118*J118)","v":19.27},"(TLV-TWA)"]
[null,null,null,"Phosgene",null,null,null,null,null,0.1,98.92,0.40557200000000004]
[null,null,null,"Pyridine",null,null,null,null,null,5,79.099999999999994,16.215500000000002]
[null,"l",null,"1,1,2,2,-Tetrachloroethane",null,null,{"$f":"L121/I121","v":0.44399032258064514},7,15.5,1,167.85,6.88185]
[null,"l",null,"Tetrachloroethylene (Perchloroethylene)",0.53,null,{"$f":"L122/I122","v":0.26753144654088051},339,636,25,166,170.15,"(TLV-TWA = 25)"]
[null,"l",null,"Toluene",1.36,17,{"$f":"L123/I123","v":2.0425992779783395},377,277,150,92,565.80000000000007,"(STEL=150, TLV=100)"]
[null,null,null,"Toxaphene",3.0000000000000001E-3,null,{"$f":"L124/I124","v":5.0000000000000001E-3},0.5,200,null,null,1,"(STEL=1, TLV=.5)"]
[null,"l",null,"1,2,4-Trichlorobenzene",0.39,197,0.39042553191489365,36.700000000000003,94]
[null,null,null,"1,1,1-Trichloroethane",1.55,33,{"$f":"L126/I126","v":1.5614110929853182},1900,1226,350,133.4,{"$f":"0.041*(K126*J126)","v":1914.2900000000002}]
[null,"l",null,"1,1,2-Trichloroethane",1.1499999999999999,null,1.1458333333333333,55,48,10,133.4,{"$f":"0.041*(K127*J127)","v":54.694000000000003}]
[null,"l",null,"Trichloroethylene",0.71,114,{"$f":"L128/I128","v":2.8502592592592588},269,378,200,131.38999999999999,{"$f":"0.041*(K128*J128)","v":1077.3979999999999},"(STEL=200, TLV=50)"]
[null,"l",null,"Trichlorofluoromethane",1.23,null,{"$f":"L129/I129","v":1.2245790509512355},5620,4573,1000,null,5600]
[null,null,null,"Triethylamine",null,null,null,null,null,5,101.19,{"$f":"0.041*(K130*J130)","v":20.743950000000002}]
[null,"l",null,"Vinyl Chloride",3.0000000000000001E-3,2.2000000000000002,{"$f":"L131/I131","v":3.0139967066572571E-3},13,4251,5,62.5,{"$f":"0.041*(K131*J131)","v":12.8125},"(STEL=5, TLV=1)"]
[null,"l",null,"Vinylidene Chloride",3.0000000000000001E-3,3.3,{"$f":"H132/I132","v":2.5753283543651817E-3},20,7766]
[null,"l",null,"Xylene",null,null,{"$f":"L133/I133","v":2.3403064516129035},655,279,150,106.17,{"$f":"0.041*(K133*J133)","v":652.94550000000004},"(STEL=150, TLV=100)"]
[null,null,null,"Aroclor 1242",0.01,null,1.2360939431396786E-2,1,80.900000000000006]
[null,null,null,"Aroclor 1248",null,null,null,null,147]
[null,null,null,"Aroclor 1254",5.0000000000000001E-3,null,4.7169811320754715E-3,0.5,106]
[null,null,null,"Aroclor 1260",null,null,null,null,30.245999999999999]
[]
[null,"Note 1 -- Gas/Vapor toxicity screening level is from the EPA manual on protection of POTW workers, or calculated from converting the concentration",null,null,null,null,null,null,null,null," "]
[null,"times the molar weight.  Since some TWA-TLV values have changed over the years column K may be more current than column G"]
[]
[null,null,null,null,null,null,null,"Cvap = (0.1*LEL%)*P/(R*T)","Cvap = mol/m3"]
[null,"Henry's #'s in Column G, Table TE-2 from R. Sander (1999) Compilation of Henry's Law ",null,null,null,null,null,"Cvap =.04087*LEL%","LEL = % v/v","(numbers used)"]
[null,"Constants for Inorganic and Organic Species of Potential Importance in Environmental ",null,null,null,null,null," (LEL% = LEL fraction * 100)","P = 1.0 atm (1.01*10^5 pa)",1]
[null,"Chemistry (V.3)  Find at http://www.mpch-mainz.mpg.de/~sander/res/henry.html",null,null,null,null,null,{"$f":"(0.1*J144*100)/(J145*J146)","v":4.0872732569833418E-2},"R = .08206 atm*L/Mol*K",0.8206]
[null,null,null,null,null,null,null,null,"T = 298.15K (@25C or 77F)",298.14999999999998,"T = Temperature - adjust Temp coefficient to the left if not 25C "]
[null,null,null,"LEL values are from Appendix A of EPA Manual \"Guidance to protect POTW workers from toxic and reactive gasses and vapors\""]
[null,null,null,"EPA credits \"Hazards evaluation and risk control services data guide bulletin HE-109A\", Hercules Corp, 1983",null,null,null,null,null,null,"Double Check"]
[null,null,null,"Table TE-2",null,null,"(RESEARCH TO FIND:)",null,null,null,"In this column"]
[null,null,null,"Compound","LEL % by volume","Cvap (10% of LEL)","Henry's Constant",null,"Henry's Constant","Liquid Concentration"]
[null,null,null,"PARAFFIN HYDROCARBONS",null,"by EPA formula","in M/atm","Molar Weight","in (mol/m3)/(mg/l)","At 10% of Explosivity Threshold"]
[null,null,null,"Methane",5,{"$f":"0.0409*E152","v":0.20449999999999999},1.4E-3,16,{"$f":"0.0409/(H152*G152)","v":1.8258928571428572},{"$f":"F152/I152","v":0.11199999999999999}]
[null,null,null,"Ethane",3,{"$f":"0.0409*E153","v":0.1227},2E-3,30,{"$f":"0.0409/(H153*G153)","v":0.68166666666666664},{"$f":"F153/I153","v":0.18000000000000002}]
[null,null,null,"Propane",2.1,8.5890000000000008E-2,1.5E-3,44,0.61969696969696964,0.13860000000000003]
[null,null,null,"Butane ",1.8,7.3620000000000005E-2,1.1000000000000001E-3,58,0.64106583072100298,0.11484000000000004]
[null,null,null,"Isobutane",1.8,7.3620000000000005E-2,8.7000000000000001E-4,58,0.81054300435988902,9.0828000000000006E-2]
[null,null,null,"Pentane",1.4,5.7259999999999991E-2,8.0000000000000004E-4,72,0.71006944444444431,8.0640000000000003E-2]
[null,null,null,"Isopentane",1.4,5.7259999999999991E-2,7.2999999999999996E-4,72,0.77815829528158298,7.3583999999999983E-2]
[null,null,null,"2,2-Dimethylpropane",1.4,5.7259999999999991E-2,4.6999999999999999E-4,72,1.208628841607565,4.7375999999999995E-2]
[null,null,null,"Hexane",1.2,4.9079999999999999E-2,7.6999999999999996E-4,86,0.61763817577771063,7.9464000000000007E-2]
[null,null,null,"Heptane",1,4.0899999999999999E-2,1.1999999999999999E-3,100,0.34083333333333332,0.12]
[null,null,null,"2,3-Dimethylpentane ",1.1000000000000001,4.4990000000000002E-2,5.8E-4,100,0.70517241379310336,6.3800000000000009E-2]
[null,null,null,"Octane",0.95,3.8854999999999994E-2,2.0000000000000001E-4,114,1.7938596491228069,2.1659999999999999E-2]
[null,null,null,"Nonane",0.85,3.4764999999999997E-2,2.0000000000000001E-4,128,1.5976562499999998,2.1760000000000002E-2]
[null,null,null,"Decane",0.75,3.0675000000000001E-2,2.1000000000000001E-4,142,1.3715627095908784,2.2365000000000003E-2]
[null,null,null,"OLEFINS:"]
[null,null,null,"Ethylene",2.7,0.11043,4.7999999999999996E-3,28,{"$f":"0.0409/(H167*G167)","v":0.30431547619047622},0.36287999999999998]
[null,null,null,"Propylene",2.4,9.8159999999999997E-2,4.7999999999999996E-3,42.08,0.20249128643852982,0.4847615999999999]
[null,null,null,"Butene-1",1.6,6.5439999999999998E-2,4.0000000000000001E-3,56.11,0.18223133131349134,0.35910400000000003]
[null,null,null,"Butene-2",1.7,6.9529999999999995E-2,4.4000000000000003E-3,56.11,0.16566484664862849,0.41970279999999999]
[null,null,null,"Amylene",1.4,5.7259999999999991E-2,4.4999999999999997E-3,70.13,0.12960058304418778,0.44181899999999991]
[null,null,null,"AROMATICS:"]
[null,null,null,"Benzene",1.4,5.7259999999999991E-2,0.18,78,2.9131054131054132E-3,19.655999999999995,"(v.s. 20.mg/L by EPA Manual)"]
[null,null,null,"Ethylbenzene",1,4.0899999999999999E-2,0.12,106,3.2154088050314468E-3,12.719999999999999]
[null,null,null,"Cumene",0.9,3.6810000000000002E-2,6.9000000000000006E-2,120,4.9396135265700478E-3,7.4520000000000008]
[null,null,null,"Toluene",1.2,4.9079999999999999E-2,0.1477,92,3.0099202260751817E-3,16.306080000000001,"(v.s. 17. mg/l by EPA Manual)"]
[null,null," ","Xylene",1.1000000000000001,4.4990000000000002E-2,0.24,106,1.6077044025157234E-3,27.983999999999998]
[null,null,null,"CYCLIC HYDROCARBONS"]
[null,null,null,"Cyclopropane",2.4,9.8159999999999997E-2,1.2999999999999999E-2,42,7.490842490842492E-2,1.3103999999999998]
[null,null,null,"Cyclohexane",1.3,5.3170000000000002E-2,5.1999999999999998E-3,84,9.3635531135531136E-2,0.56784000000000001]
[null,null,null,"Methylcyclohexane",1.1000000000000001,4.4990000000000002E-2,9.7000000000000003E-3,98,4.3025457605722697E-2,1.0456600000000003]
[null,null,"Not greatly ","ALCOHOLS"]
[null,null,"Flammable ","Methyl Alcohol",6.7,0.27403,220,32,5.8096590909090909E-6,47168]
[null,null,"(darkened)","Ethyl Alcohol",3.3,0.13496999999999998,120,46,7.4094202898550721E-6,18215.999999999996]
[null,null,null,"Allyl Alcohol",2.5,0.10224999999999999,440,58,1.6026645768025078E-6,63800]
[null,null,null,"n-Propyl alcohol",2.2000000000000002,8.9980000000000004E-2,140,60.1,4.8609460423104345E-6,18510.800000000003]
[null,null,null,"Isopropyl Alcohol",2.2000000000000002,8.9980000000000004E-2,150,60,4.544444444444444E-6,19800.000000000004]
[null,null,null,"n-Butyl alcohol",1.7,6.9529999999999995E-2,120,74.12,4.5983989926245721E-6,15120.480000000001]
[null,null,null,"n-Amyl alcohol",1.4,5.7259999999999991E-2,82,88,5.6679600886917962E-6,10102.399999999998]
[null,null,null,"Isoamyl alcohol ",1.4,5.7259999999999991E-2,null,88.15,{"$error":"#DIV/0!"},{"$error":"#DIV/0!"}]
[null,null,null,"ALDEHYDES"]
[null,null,null,"Acetaldehyde",4,0.1636,14,44.05,6.6320739419490848E-5,2466.7999999999997]
[null,null,null,"Crotonaldehyde",2.1,8.5890000000000008E-2,59,70.09,9.8904314307754418E-6,8684.1510000000017]
[null,null,null,"Paraldehyde",1.3,5.3170000000000002E-2,null,132.16,{"$error":"#DIV/0!"},{"$error":"#DIV/0!"}]
[null,null,null,"Propionaldehyde",2.9,0.11860999999999999,2.8,58.08,2.5150039354584808E-4,471.6096]
[null,null,null,"ETHERS"]
[null,null,null,"Methyl ethyl ether",2.2000000000000002,8.9980000000000004E-2,0.9,60.1,7.5614716213717867E-4,118.99800000000002]
[null,null,null,"Diethyl ether",1.9,7.7709999999999987E-2,0.8,74.12,6.8975984889368578E-4,112.66240000000001]
[null,null,null,"Divinyl ether 109-93-3",1.7,6.9529999999999995E-2,null,70.09,{"$error":"#DIV/0!"},{"$error":"#DIV/0!"}]
[null,null,null,"Tetrahydrofuran",2,8.1799999999999998E-2,14,72.11,4.0513501198565685E-5,2019.08]
[null,null,null,"KETONES"]
[null,null,null,"Acetone",2.6,0.10634,27,58,2.6117496807151977E-5,4071.6000000000004]
[null,null,null,"Acetophenone",1.1000000000000001,4.4990000000000002E-2,98,120,3.4778911564625849E-6,12936.000000000002]
[null,null,null,"Methyl ethyl ketone",1.9,7.7709999999999987E-2,17.257400000000001,72,3.2916636083972998E-5,2360.8123199999995,"(Compared to 2,486 mg/L by the EPA Manual!!!?)"]
[null,null,null,"Methyl propyl ketone",1.6,6.5439999999999998E-2,12,86.13,3.9571964859321181E-5,1653.6959999999999]
[null,null,null,"Methyl butyl ketone",1.2,4.9079999999999999E-2,null,100.16,{"$error":"#DIV/0!"},{"$error":"#DIV/0!"}]
[null,null,null,"ACIDS"]
[null,null,null,"Acetic acid",5.4,0.22086,5200,60,1.3108974358974358E-7,1684800.0000000002]
[null,null,null,"Adipic",1.6,6.5439999999999998E-2,18000000,146,1.556316590563166E-11,4204799999.9999995]
[null,null,null,"Hydrogen cyanide",5.6,0.22903999999999997,7.5,27.03,2.0175114070785543E-4,1135.26]
[null,null,null,"Hydrogen sulfide",4,0.1636,0.1,34,1.202941176470588E-2,13.600000000000001]
[null,null,null,"ESTERS"]
[null,null,null,"Methyl formate",5,0.20449999999999999,4.0999999999999996,60,1.6626016260162604E-4,1229.9999999999998]
[null,null,null,"Ethyl formate",2.8,0.11451999999999998,0.14000000000000001,74,3.9478764478764472E-3,29.007999999999999]
[null,null,null,"Methyl acetate",3.2,0.13088,8.6999999999999993,74,6.3529046287666985E-5,2060.16]
[null,null,null,"Ethyl acetate",2.2000000000000002,8.9980000000000004E-2,9,74,6.1411411411411407E-5,1465.2000000000003]
[null,null,null,"Propyl acetate ",1.8,{"$f":"0.0409*E217","v":7.3620000000000005E-2},4.5,90,{"$f":"0.0409/(H217*G217)","v":1.0098765432098765E-4},{"$f":"F217/I217","v":729.00000000000011}]
[null,null,null,"Isopropyl acetate",1.7,6.9529999999999995E-2,2.9,102,1.3826910074374576E-4,502.86]
[null,null,null,"Butyl acetate",1.4,5.7259999999999991E-2,3.5,116,1.0073891625615763E-4,568.4]
[null,null,null,"Amyl acetate",1,4.0899999999999999E-2,2.8,130,1.1236263736263736E-4,364]
[null,null,null,"HYDROGEN"]
[null,null,null,"Hydrogen",4,0.1636,null,2,{"$error":"#DIV/0!"},{"$error":"#DIV/0!"}]
[null,null,null,"NITROGEN COMPOUNDS"]
[null,null,null,"Ammonia",15,0.61349999999999993,61,17,3.9440694310511091E-5,15554.999999999998]
[null,null,null,"Anlinine (Alinine?)",1.2,4.9079999999999999E-2,null,null,{"$error":"#DIV/0!"},{"$error":"#DIV/0!"}]
[null,null,null,"Cyanogen",6.6,0.26993999999999996,0.19,50,4.3052631578947365E-3,62.699999999999996]
[null,null,null,"Pyridine",1.8,7.3620000000000005E-2,90,79,5.7524613220815749E-6,12798.000000000002]
[null,null,null,"Ethyl nitrate",4,0.1636,1.6,91,2.8090659340659343E-4,582.4]
[null,null,null,"Ethyl nitrite",3,0.1227,2,77,2.6558441558441559E-4,462]
[null,null,null,"OXIDES"]
[null,null,null,"Carbon monoxide",12.5,0.51124999999999998,1E-3,28.01,1.4601927882898962,0.35012500000000008]
[null,null,null,"Ethylene oxide",3.6,0.14724000000000001,null,44.05,{"$error":"#DIV/0!"},{"$error":"#DIV/0!"}]
[null,null,null,"Propylene oxide",2.8,0.11451999999999998,5.2,58.08,1.3542328883237972E-4,845.64480000000003]
[null,null,null,"Dioxan",2,8.1799999999999998E-2,140,88,3.3198051948051946E-6,24640]
[null,null,null,"SULFIDES"]
[null,null,null,"Carbon disulfide",1.3,5.3170000000000002E-2,5.4999999999999997E-3,76,9.7846889952153113E-2,0.54339999999999999]
[null,null,null,"Dimethyl sulfide",2.2000000000000002,8.9980000000000004E-2,0.48,62,1.3743279569892475E-3,65.471999999999994]
[null,null,null,"Hydrogen sulfide",4,0.1636,0.1,34,1.202941176470588E-2,13.600000000000001]
[null,null,null,"Ethyl mercaptan",2.8,0.11451999999999998,0.34,60,2.0049019607843136E-3,57.12]
[null,null,null,"CHLORIDES"]
[null,null,null,"Methyl chloride",7,0.2863,0.12,50.45,6.7558638916418888E-3,42.378000000000007]
[null,null,null,"Ethyl chloride (chlorethane)",3.8,0.15541999999999997,6.8999999999999999E-3,62.45,9.4916512920481297E-2,1.6374390000000001]
[null,null,null,"Propyl chloride",2.4,9.8159999999999997E-2,9.1999999999999998E-3,78.540000000000006,5.6603669135638433E-2,1.7341632000000002]
[null,null,null,"Butyl chloride",1.8,7.3620000000000005E-2,5.6000000000000001E-2,92.57,7.8897822497260763E-3,9.3310560000000002]
[null,null,null,"Allyl chloride",2.9,0.11860999999999999,0.11,76.52,4.8590980373520885E-3,24.409879999999998]
[null,null,null,"Amyl chloride",1.6,6.5439999999999998E-2,0.02,106.59,1.9185664696500609E-2,3.4108800000000001]
[null,null,null,"Vinyl chloride",3.6,0.14724000000000001,4.3999999999999997E-2,62.45,1.4884634980711842E-2,9.89208,"(v.s. 2.2 mg/l in EPA manual)"]
[null,null,null,"Propylene dichloride (1,2)",3.1,0.12679000000000001,0.34,112.99,1.0646439299677743E-3,119.09146000000001]
[null,null,null,"Chlorobenzene",1.4,5.7259999999999991E-2,0.32,112.45,1.1366162738995107E-3,50.377600000000001]
[null,null,null,"BROMIDES"]
[null,null,null,"Methyl bromide",10,0.40899999999999997,4.4000000000000003E-3,94.94,9.790872704291706E-2,4.1773599999999993,"(Note EPA data used is far more conservative than other sources"]
[null,null,null,"Allyl bromide ",2.7,0.11043,0.17,120.98,1.9886612274269931E-3,55.529820000000008]
[null,null,"Not greatly ","AMINES"]
[null,null,"Flammable ","Methyl amine",4.2,0.17178000000000002,140,31,9.4239631336405525E-6,18228.000000000004]
[null,null,"(darkened)","Ethyl amine ",3.5,0.14315,35,45,2.5968253968253968E-5,5512.5]
[null,null,null,"Dimethyl amine ",2.8,0.11451999999999998,15,74,3.6846846846846844E-5,3107.9999999999995]
[null,null,null,"Propyl amine",2,8.1799999999999998E-2,67,59,1.0346572223627625E-5,7905.9999999999991]
[null,null,null,"Diethyl amine ",1.8,7.3620000000000005E-2,130,73,4.3097997892518438E-6,17082.000000000004]
[null,null,null,"Trimethyl amine",2,8.1799999999999998E-2,9.6,59,7.2210451977401132E-5,1132.8]
[null,null,null,"Triethyl amine",1.2,4.9079999999999999E-2,6.7,101,6.0440372395448494E-5,812.04000000000008]
[null,null,null,"FUELS"]
[null,null,null,"Gasoline",1.4,5.7259999999999991E-2,3.0000000000000001E-3,114,0.11959064327485379,0.4788]
[null,null,null,"Jet fuel JP-4",1.3,5.3170000000000002E-2,null,null,{"$error":"#DIV/0!"},{"$error":"#DIV/0!"}]
[null,null,null,"Hydrazine 302-01-2",4.7,0.19223000000000001,null,32.049999999999997,{"$error":"#DIV/0!"},{"$error":"#DIV/0!"}]
[null,null,null,"SOLVENTS"]
[null,null,null,"Butyl cellosolve",1.1000000000000001,4.4990000000000002E-2,null,118.17,{"$error":"#DIV/0!"},{"$error":"#DIV/0!"}]
[null,null,null,"Methyl cellosolve",2.5,0.10224999999999999,2.1999999999999999E-2,76.09,2.4432788922209344E-2,4.1849499999999997]
[null,null,null,"Methyl cellosolve acetate",1.7,6.9529999999999995E-2,null,118.13,{"$error":"#DIV/0!"},{"$error":"#DIV/0!"}]
[null,null,null,"N,N-Dimethyl formamide",1.8,7.3620000000000005E-2,null,null,{"$error":"#DIV/0!"},{"$error":"#DIV/0!"}]
[null,null,null,"Turpentine",0.7,2.8629999999999996E-2,null,null,{"$error":"#DIV/0!"},{"$error":"#DIV/0!"}]
[]
[]
[null,null,null,"Table TE-3 Explosivity Range"]
[null,null,null,"Fuel Gas","\"Lower Explosive or Flammable Limit\"","\"Upper Explosive or Flammable Limit\""]
[null,null,null,null,"(LEL/LFL)","(UEL/UFL)"]
[null,null,null,null,"(%)","(%)"]
[null,null,null,"Acetaldehyde",4,60]
[null,null,null,"Acetone",2.6,12.8]
[null,null,null,"Acetylene",2.5,81]
[null,null,null,"Ammonia",15,28]
[null,null,null,"Arsine",5.0999999999999996,78]
[null,null,null,"Benzene",1.35,6.65]
[null,null,null,"n-Butane",1.86,8.41]
[null,null,null,"iso-Butane",1.8,8.44]
[null,null,null,"iso-Butene",1.8,9]
[null,null,null,"Butylene",1.98,9.65]
[null,null,null,"Carbon Disulfide",1.3,50]
[null,null,null,"Carbon Monoxide",12,75]
[null,null,null,"Cyclohexane",1.3,8]
[null,null,null,"Cyclopropane",2.4,10.4]
[null,null,null,"Diethyl Ether",1.9,36]
[null,null,null,"Ethane",3,12.4]
[null,null,null,"Ethylene",2.75,28.6]
[null,null,null,"Ethyl Alcohol",3.3,19]
[null,null,null,"Ethyl Chloride",3.8,15.4]
[null,null,null,"Fuel Oil No.1",0.7,5]
[null,null,null,"Hydrogen",4,75]
[null,null,null,"Isobutane",1.8,9.6]
[null,null,null,"Isopropyl Alcohol",2,12]
[null,null,null,"Gasoline",1.4,7.6]
[null,null,null,"Kerosine",0.7,5]
[null,null,null,"Methane",5,15]
[null,null,null,"Methyl Alcohol",6.7,36]
[null,null,null,"Methyl Chloride",10.7,17.399999999999999]
[null,null,null,"Methyl Ethyl Ketone",1.8,10]
[null,null,null,"Naphthalene",0.9,5.9]
[null,null,null,"n-Heptane",1,6]
[null,null,null,"n-Hexane",1.25,7]
[null,null,null,"n-Pentene",1.65,7.7]
[null,null,null,"Neopentane",1.38,7.22]
[null,null,null,"Neohexane",1.19,7.58]
[null,null,null,"n-Octane",0.95,3.2]
[null,null,null,"iso-Octane",0.79,5.94]
[null,null,null,"n-Pentane",1.4,7.8]
[null,null,null,"iso-Pentane",1.32,9.16]
[null,null,null,"Propane",2.1,10.1]
[null,null,null,"Propylene",2,11.1]
[null,null,null,"Silane",1.5,98]
[null,null,null,"Styrene",1.1000000000000001,6.1]
[null,null,null,"Toluene",1.27,6.75]
[null,null,null,"Triptane",1.08,6.69]
[null,null,null,"p-Xylene",1,6]

{"sheet":"WA-OSHA-STDS","index":8,"n_rows":1241,"n_cols":6,"rows_kept":1241,"cut":false,"hidden":false,"merged":[[14,0,14,5],[22,1,24,1],[22,2,24,2],[22,3,24,3],[22,4,24,4],[22,5,24,5],[1,0,1,3],[33,1,34,1],[33,2,34,2],[33,3,34,3],[33,4,34,4],[33,5,34,5],[38,1,39,1],[38,2,39,2],[38,3,39,3],[38,4,39,4],[38,5,39,5],[27,1,28,1],[27,2,28,2],[27,3,28,3],[27,4,28,4],[27,5,28,5],[30,1,31,1],[30,2,31,2],[30,3,31,3],[30,4,31,4],[30,5,31,5],[60,1,61,1],[60,2,61,2],[60,3,61,3],[60,4,61,4],[60,5,61,5],[62,1,63,1],[62,2,63,2],[62,3,63,3],[62,4,63,4],[62,5,63,5],[45,1,46,1],[45,2,46,2],[45,3,46,3],[45,4,46,4],[45,5,46,5],[56,1,57,1],[56,2,57,2],[56,3,57,3],[56,4,57,4],[56,5,57,5],[83,1,84,1],[83,2,84,2],[83,3,84,3],[83,4,84,4],[83,5,84,5],[86,1,87,1],[86,2,87,2],[86,3,87,3],[86,4,87,4],[86,5,87,5],[71,1,73,1],[71,2,73,2],[71,3,73,3],[71,4,73,4],[71,5,73,5],[78,1,81,1],[78,2,81,2],[78,3,81,3],[78,4,81,4],[78,5,81,5],[98,1,100,1],[98,2,100,2],[98,3,100,3],[98,4,100,4],[98,5,100,5],[105,1,106,1],[105,2,106,2],[105,3,106,3],[105,4,106,4],[105,5,106,5],[88,1,91,1],[88,2,91,2],[88,3,91,3],[88,4,91,4],[88,5,91,5],[92,1,96,1],[92,2,96,2],[92,3,96,3],[92,4,96,4],[92,5,96,5],[118,1,119,1],[118,2,119,2],[118,3,119,3],[118,4,119,4],[118,5,119,5],[120,1,121,1],[120,2,121,2],[120,3,121,3],[120,4,121,4],[120,5,121,5],[114,1,115,1],[114,2,115,2],[114,3,115,3],[114,4,115,4],[114,5,115,5],[116,1,117,1],[116,2,117,2],[116,3,117,3],[116,4,117,4],[116,5,117,5],[145,1,147,1],[145,2,147,2],[145,3,147,3],[145,4,147,4],[145,5,147,5],[149,1,150,1],[149,2,150,2],[149,3,150,3],[149,4,150,4],[149,5,150,5],[124,1,125,1],[124,2,125,2],[124,4,125,4],[124,5,125,5],[142,1,143,1],[142,2,143,2],[142,3,143,3],[142,4,143,4],[142,5,143,5],[164,1,166,1],[164,2,166,2],[164,3,166,3],[164,4,166,4],[164,5,166,5],[172,1,174,1],[172,2,174,2],[172,3,174,3],[172,4,174,4],[172,5,174,5],[151,1,152,1],[151,2,152,2],[151,3,152,3],[151,4,152,4],[151,5,152,5],[153,1,154,1],[153,2,154,2],[153,3,154,3],[153,4,154,4],[153,5,154,5],[196,1,197,1],[196,2,197,2],[196,3,197,3],[196,4,197,4],[196,5,197,5],[206,1,207,1],[206,2,207,2],[206,3,207,3],[206,4,207,4],[206,5,207,5],[175,1,177,1],[175,2,177,2],[175,3,177,3],[175,4,177,4],[175,5,177,5],[178,1,179,1],[178,2,179,2],[178,3,179,3],[178,4,179,4],[178,5,179,5],[219,1,220,1],[219,2,220,2],[219,3,220,3],[219,4,220,4],[219,5,220,5],[226,1,227,1],[226,2,227,2],[226,3,227,3],[226,4,227,4],[226,5,227,5],[208,1,209,1],[208,2,209,2],[208,3,209,3],[208,4,209,4],[208,5,209,5],[212,1,213,1],[212,2,213,2],[212,3,213,3],[212,4,213,4],[212,5,213,5],[234,1,235,1],[234,2,235,2],[234,3,235,3],[234,4,235,4],[234,5,235,5],[237,1,239,1],[237,2,239,2],[237,3,239,3],[237,4,239,4],[237,5,239,5],[229,1,230,1],[229,2,230,2],[229,3,230,3],[229,4,230,4],[229,5,230,5],[231,1,232,1],[231,2,232,2],[231,3,232,3],[231,4,232,4],[231,5,232,5],[246,1,247,1],[246,2,247,2],[246,3,247,3],[246,4,247,4],[246,5,247,5],[248,1,250,1],[248,2,250,2],[248,3,250,3],[248,4,250,4],[248,5,250,5],[240,1,243,1],[240,2,243,2],[240,3,243,3],[240,4,243,4],[240,5,243,5],[244,1,245,1],[244,2,245,2],[244,3,245,3],[244,4,245,4],[244,5,245,5],[261,1,262,1],[261,2,262,2],[261,3,262,3],[261,4,262,4],[261,5,262,5],[265,1,266,1],[265,2,266,2],[265,3,266,3],[265,4,266,4],[265,5,266,5],[253,1,254,1],[253,2,254,2],[253,3,254,3],[253,4,254,4],[253,5,254,5],[255,1,258,1],[255,2,258,2],[255,3,258,3],[255,4,258,4],[255,5,258,5],[280,1,283,1],[280,2,283,2],[280,3,283,3],[280,4,283,4],[280,5,283,5],[284,1,285,1],[284,2,285,2],[284,3,285,3],[284,4,285,4],[284,5,285,5],[270,2,274,2],[270,3,274,3],[270,4,274,4],[270,5,274,5],[276,1,279,1],[276,2,279,2],[276,3,279,3],[276,4,279,4],[276,5,279,5],[296,1,297,1],[296,2,297,2],[296,3,297,3],[296,4,297,4],[296,5,297,5],[299,1,306,1],[299,2,306,2],[299,3,306,3],[299,4,306,4],[299,5,306,5],[286,1,287,1],[286,2,287,2],[286,3,287,3],[286,4,287,4],[286,5,287,5],[288,1,290,1],[288,2,290,2],[288,3,290,3],[288,4,290,4],[288,5,290,5],[320,1,322,1],[320,2,322,2],[320,3,322,3],[320,4,322,4],[320,5,322,5],[326,1,328,1],[326,2,328,2],[326,3,328,3],[326,4,328,4],[326,5,328,5],[307,1,308,1],[307,2,308,2],[307,3,308,3],[307,4,308,4],[307,5,308,5],[311,1,312,1],[311,2,312,2],[311,3,312,3],[311,4,312,4],[311,5,312,5],[346,1,347,1],[346,2,347,2],[346,3,347,3],[346,4,347,4],[346,5,347,5],[348,1,349,1],[348,2,349,2],[348,3,349,3],[348,4,349,4],[348,5,349,5],[329,2,330,2],[329,3,330,3],[329,4,330,4],[329,5,330,5],[334,0,335,0],[334,2,335,2],[334,3,335,3],[334,4,335,4],[334,5,335,5],[356,1,357,1],[356,2,357,2],[356,3,357,3],[356,4,357,4],[356,5,357,5],[360,1,362,1],[360,2,362,2],[360,3,362,3],[360,4,362,4],[360,5,362,5],[350,1,352,1],[350,2,352,2],[350,3,352,3],[350,4,352,4],[350,5,352,5],[353,1,354,1],[353,2,354,2],[353,3,354,3],[353,4,354,4],[353,5,354,5],[379,1,380,1],[379,2,380,2],[379,3,380,3],[379,4,380,4],[379,5,380,5],[381,1,382,1],[381,2,382,2],[381,3,382,3],[381,4,382,4],[381,5,382,5],[363,1,364,1],[363,2,364,2],[363,3,364,3],[363,4,364,4],[363,5,364,5],[369,1,372,1],[369,2,372,2],[369,3,372,3],[369,4,372,4],[369,5,372,5],[388,1,389,1],[388,2,389,2],[388,3,389,3],[388,4,389,4],[388,5,389,5],[390,1,391,1],[390,2,391,2],[390,3,391,3],[390,4,391,4],[390,5,391,5],[384,1,385,1],[384,2,385,2],[384,3,385,3],[384,4,385,4],[384,5,385,5],[386,1,387,1],[386,2,387,2],[386,3,387,3],[386,4,387,4],[386,5,387,5],[400,1,401,1],[400,2,401,2],[400,3,401,3],[400,4,401,4],[400,5,401,5],[402,1,403,1],[402,2,403,2],[402,3,403,3],[402,4,403,4],[402,5,403,5],[392,1,393,1],[392,2,393,2],[392,3,393,3],[392,4,393,4],[392,5,393,5],[396,1,398,1],[396,2,398,2],[396,3,398,3],[396,4,398,4],[396,5,398,5],[432,1,433,1],[432,2,433,2],[432,3,433,3],[432,4,433,4],[432,5,433,5],[434,1,435,1],[434,2,435,2],[434,3,435,3],[434,4,435,4],[434,5,435,5],[424,1,425,1],[424,2,425,2],[424,3,425,3],[424,4,425,4],[424,5,425,5],[426,1,427,1],[426,2,427,2],[426,3,427,3],[426,4,427,4],[426,5,427,5],[443,1,444,1],[443,2,444,2],[443,3,444,3],[443,4,444,4],[443,5,444,5],[448,1,449,1],[448,2,449,2],[448,3,449,3],[448,4,449,4],[448,5,449,5],[436,1,437,1],[436,2,437,2],[436,3,437,3],[436,4,437,4],[436,5,437,5],[439,1,441,1],[439,2,441,2],[439,3,441,3],[439,4,441,4],[439,5,441,5],[461,1,462,1],[461,2,462,2],[461,3,462,3],[461,4,462,4],[461,5,462,5],[466,1,467,1],[466,2,467,2],[466,3,467,3],[466,4,467,4],[466,5,467,5],[450,2,452,2],[450,3,452,3],[450,4,452,4],[450,5,452,5],[454,1,455,1],[454,2,455,2],[454,3,455,3],[454,4,455,4],[454,5,455,5],[483,1,484,1],[483,2,484,2],[483,3,484,3],[483,4,484,4],[483,5,484,5],[486,1,487,1],[486,2,487,2],[486,3,487,3],[486,4,487,4],[486,5,487,5],[478,1,479,1],[478,2,479,2],[478,3,479,3],[478,4,479,4],[478,5,479,5],[481,1,482,1],[481,2,482,2],[481,3,482,3],[481,4,482,4],[481,5,482,5],[494,1,495,1],[494,2,495,2],[494,3,495,3],[494,4,495,4],[494,5,495,5],[500,1,501,1],[500,2,501,2],[500,3,501,3],[500,4,501,4],[500,5,501,5],[488,1,489,1],[488,2,489,2],[488,3,489,3],[488,4,489,4],[488,5,489,5],[492,1,493,1],[492,2,493,2],[492,3,493,3],[492,4,493,4],[492,5,493,5],[510,1,511,1],[510,2,511,2],[510,3,511,3],[510,4,511,4],[510,5,511,5],[513,1,514,1],[513,2,514,2],[513,3,514,3],[513,4,514,4],[513,5,514,5],[504,1,505,1],[504,2,505,2],[504,3,505,3],[504,4,505,4],[504,5,505,5],[508,1,509,1],[508,2,509,2],[508,3,509,3],[508,4,509,4],[508,5,509,5],[521,1,522,1],[521,2,522,2],[521,3,522,3],[521,4,522,4],[521,5,522,5],[525,1,526,1],[525,2,526,2],[525,3,526,3],[525,4,526,4],[525,5,526,5],[517,1,518,1],[517,2,518,2],[517,3,518,3],[517,4,518,4],[517,5,518,5],[519,1,520,1],[519,2,520,2],[519,3,520,3],[519,4,520,4],[519,5,520,5],[542,1,543,1],[542,2,543,2],[542,3,543,3],[542,4,543,4],[542,5,543,5],[545,1,546,1],[545,2,546,2],[545,3,546,3],[545,4,546,4],[545,5,546,5],[530,1,531,1],[530,2,531,2],[530,3,531,3],[530,4,531,4],[530,5,531,5],[539,0,540,0],[539,2,540,2],[539,3,540,3],[539,4,540,4],[539,5,540,5],[562,1,563,1],[562,2,563,2],[562,3,563,3],[562,4,563,4],[562,5,563,5],[570,1,571,1],[570,2,571,2],[570,3,571,3],[570,4,571,4],[570,5,571,5],[549,1,550,1],[549,2,550,2],[549,3,550,3],[549,4,550,4],[549,5,550,5],[560,1,561,1],[560,2,561,2],[560,3,561,3],[560,4,561,4],[560,5,561,5],[590,0,591,0],[590,2,591,2],[590,3,591,3],[590,4,591,4],[590,5,591,5],[592,1,593,1],[592,2,593,2],[592,3,593,3],[592,4,593,4],[592,5,593,5],[579,1,580,1],[579,2,580,2],[579,3,580,3],[579,4,580,4],[579,5,580,5],[581,1,582,1],[581,2,582,2],[581,3,582,3],[581,4,582,4],[581,5,582,5],[610,1,611,1],[610,2,611,2],[610,3,611,3],[610,4,611,4],[610,5,611,5],[620,0,621,0],[620,2,621,2],[620,3,621,3],[620,4,621,4],[620,5,621,5],[594,1,595,1],[594,2,595,2],[594,3,595,3],[594,4,595,4],[594,5,595,5],[608,1,609,1],[608,2,609,2],[608,3,609,3],[608,4,609,4],[608,5,609,5],[643,1,645,1],[643,2,645,2],[643,3,645,3],[643,4,645,4],[643,5,645,5],[646,1,649,1],[646,2,649,2],[646,3,649,3],[646,4,649,4],[646,5,649,5],[623,1,624,1],[623,2,624,2],[623,3,624,3],[623,4,624,4],[623,5,624,5],[641,1,642,1],[641,2,642,2],[641,3,642,3],[641,4,642,4],[641,5,642,5],[670,1,671,1],[670,2,671,2],[670,3,671,3],[670,4,671,4],[670,5,671,5],[672,1,673,1],[672,2,673,2],[672,3,673,3],[672,4,673,4],[672,5,673,5],[650,1,653,1],[650,2,653,2],[650,3,653,3],[650,4,653,4],[650,5,653,5],[659,1,660,1],[659,2,660,2],[659,3,660,3],[659,4,660,4],[659,5,660,5],[685,1,689,1],[685,2,689,2],[685,3,689,3],[685,4,689,4],[685,5,689,5],[690,1,692,1],[690,2,692,2],[690,3,692,3],[690,4,692,4],[690,5,692,5],[677,1,680,1],[677,2,680,2],[677,3,680,3],[677,4,680,4],[677,5,680,5],[681,1,684,1],[681,2,684,2],[681,3,684,3],[681,4,684,4],[681,5,684,5],[704,1,705,1],[704,2,705,2],[704,3,705,3],[704,4,705,4],[704,5,705,5],[709,1,710,1],[709,2,710,2],[709,3,710,3],[709,4,710,4],[709,5,710,5],[693,1,694,1],[693,2,694,2],[693,3,694,3],[693,4,694,4],[693,5,694,5],[702,1,703,1],[702,2,703,2],[702,3,703,3],[702,4,703,4],[702,5,703,5],[723,1,724,1],[723,2,724,2],[723,3,724,3],[723,4,724,4],[723,5,724,5],[725,1,726,1],[725,2,726,2],[725,3,726,3],[725,4,726,4],[725,5,726,5],[711,1,712,1],[711,2,712,2],[711,3,712,3],[711,4,712,4],[711,5,712,5],[716,1,717,1],[716,2,717,2],[716,3,717,3],[716,4,717,4],[716,5,717,5],[732,1,733,1],[732,2,733,2],[732,3,733,3],[732,4,733,4],[732,5,733,5],[734,1,735,1],[734,2,735,2],[734,3,735,3],[734,4,735,4],[734,5,735,5],[727,1,728,1],[727,2,728,2],[727,3,728,3],[727,4,728,4],[727,5,728,5],[730,1,731,1],[730,2,731,2],[730,3,731,3],[730,4,731,4],[730,5,731,5],[747,1,748,1],[747,2,748,2],[747,3,748,3],[747,4,748,4],[747,5,748,5],[750,1,752,1],[750,2,752,2],[750,3,752,3],[750,4,752,4],[750,5,752,5],[737,1,738,1],[737,2,738,2],[737,3,738,3],[737,4,738,4],[737,5,738,5],[739,1,742,1],[739,2,742,2],[739,3,742,3],[739,4,742,4],[739,5,742,5],[758,1,760,1],[758,2,760,2],[758,3,760,3],[758,4,760,4],[758,5,760,5],[761,1,763,1],[761,2,763,2],[761,3,763,3],[761,4,763,4],[761,5,763,5],[753,1,755,1],[753,2,755,2],[753,3,755,3],[753,4,755,4],[753,5,755,5],[756,1,757,1],[756,2,757,2],[756,3,757,3],[756,4,757,4],[756,5,757,5],[769,1,770,1],[769,2,770,2],[769,3,770,3],[769,4,770,4],[769,5,770,5],[771,1,772,1],[771,2,772,2],[771,3,772,3],[771,4,772,4],[771,5,772,5],[764,1,765,1],[764,2,765,2],[764,3,765,3],[764,4,765,4],[764,5,765,5],[766,1,767,1],[766,2,767,2],[766,3,767,3],[766,4,767,4],[766,5,767,5],[784,1,785,1],[784,2,785,2],[784,3,785,3],[784,4,785,4],[784,5,785,5],[790,1,791,1],[790,2,791,2],[790,3,791,3],[790,4,791,4],[790,5,791,5],[775,1,776,1],[775,2,776,2],[775,3,776,3],[775,4,776,4],[775,5,776,5],[777,1,778,1],[777,2,778,2],[777,3,778,3],[777,4,778,4],[777,5,778,5],[805,1,806,1],[805,2,806,2],[805,3,806,3],[805,4,806,4],[805,5,806,5],[807,1,808,1],[807,2,808,2],[807,3,808,3],[807,4,808,4],[807,5,808,5],[795,1,796,1],[795,2,796,2],[795,3,796,3],[795,4,796,4],[795,5,796,5],[798,1,799,1],[798,2,799,2],[798,3,799,3],[798,4,799,4],[798,5,799,5],[825,1,826,1],[825,2,826,2],[825,3,826,3],[825,4,826,4],[825,5,826,5],[828,1,829,1],[828,2,829,2],[828,3,829,3],[828,4,829,4],[828,5,829,5],[812,1,813,1],[812,2,813,2],[812,3,813,3],[812,4,813,4],[812,5,813,5],[816,1,818,1],[816,2,818,2],[816,3,818,3],[816,4,818,4],[816,5,818,5],[846,1,847,1],[846,2,847,2],[846,3,847,3],[846,4,847,4],[846,5,847,5],[848,1,849,1],[848,2,849,2],[848,3,849,3],[848,4,849,4],[848,5,849,5],[833,1,834,1],[833,2,834,2],[833,3,834,3],[833,4,834,4],[833,5,834,5],[840,1,841,1],[840,2,841,2],[840,3,841,3],[840,4,841,4],[840,5,841,5],[880,1,882,1],[880,2,882,2],[880,3,882,3],[880,4,882,4],[880,5,882,5],[883,1,884,1],[883,2,884,2],[883,3,884,3],[883,4,884,4],[883,5,884,5],[857,1,867,1],[857,2,867,2],[857,3,867,3],[857,4,867,4],[857,5,867,5],[870,1,871,1],[870,2,871,2],[870,3,871,3],[870,4,871,4],[870,5,871,5],[903,1,904,1],[903,2,904,2],[903,3,904,3],[903,4,904,4],[903,5,904,5],[905,1,906,1],[905,2,906,2],[905,3,906,3],[905,4,906,4],[905,5,906,5],[894,1,895,1],[894,2,895,2],[894,3,895,3],[894,4,895,4],[894,5,895,5],[896,1,897,1],[896,2,897,2],[896,3,897,3],[896,4,897,4],[896,5,897,5],[935,1,937,1],[935,2,937,2],[935,3,937,3],[935,4,937,4],[935,5,937,5],[946,1,947,1],[946,2,947,2],[946,3,947,3],[946,4,947,4],[946,5,947,5],[911,1,912,1],[911,2,912,2],[911,3,912,3],[911,4,912,4],[911,5,912,5],[933,1,934,1],[933,2,934,2],[933,3,934,3],[933,4,934,4],[933,5,934,5],[967,1,968,1],[967,2,968,2],[967,3,968,3],[967,4,968,4],[967,5,968,5],[970,1,971,1],[970,2,971,2],[970,3,971,3],[970,4,971,4],[970,5,971,5],[956,1,957,1],[956,2,957,2],[956,3,957,3],[956,4,957,4],[956,5,957,5],[964,1,965,1],[964,2,965,2],[964,3,965,3],[964,4,965,4],[964,5,965,5],[985,1,986,1],[985,2,986,2],[985,3,986,3],[985,4,986,4],[985,5,986,5],[997,1,998,1],[997,2,998,2],[997,3,998,3],[997,4,998,4],[997,5,998,5],[975,1,976,1],[975,2,976,2],[975,3,976,3],[975,4,976,4],[975,5,976,5],[981,1,982,1],[981,2,982,2],[981,3,982,3],[981,4,982,4],[981,5,982,5],[1011,1,1012,1],[1011,2,1012,2],[1011,3,1012,3],[1011,4,1012,4],[1011,5,1012,5],[1024,1,1028,1],[1024,2,1028,2],[1024,3,1028,3],[1024,4,1028,4],[1024,5,1028,5],[1000,1,1001,1],[1000,2,1001,2],[1000,3,1001,3],[1000,4,1001,4],[1000,5,1001,5],[1002,1,1004,1],[1002,2,1004,2]],"merged_total":1183,"flags":["merged_cut"]}
["WAC 296-841-20025","Agency filings affecting this section"]
["Permissible exposure limits (PELs)"]
["     The following information applies to Table 3, Permissible Exposure Limits (PELs) for Airborne Contaminants."]
["     • ppm refers to parts of vapor or gas per million parts of air by volume, at 25 degrees C and 760 mm Hg pressure."]
["     • mg/m3 refers to milligrams of an airborne contaminant per cubic meter of air."]
["     • F/cc refers to fibers per cubic centimeter of air."]
["     • For a metal that is measured as the metal itself, only the CAS number for the metal is given. The CAS numbers for individual compounds of the metal are not provided. For more information about CAS registry numbers see the web site: http://www.cas.org."]
["     • Short-term exposure limits (STEL) pertain to fifteen-minute exposure periods, unless another time period is noted in Table 3."]
["     • An \"X\" in the \"skin\" column indicates the contaminant can be absorbed through the skin, either by airborne or direct contact."]
["     – Personal protective equipment (PPE) to prevent skin contact may be needed to minimize the risk for adverse health effects when employees are exposed to these chemicals."]
["     – Requirements for the use of gloves, coveralls, goggles, and other personal protective equipment can be found in WAC 296-800-160, Personal protective equipment (PPE)."]
["     • Nuisance dusts (also known as inert dusts) are included in the Table 3 listing, particulates not otherwise regulated (PNOR)."]
["     – The PNOR listing in Table 3 also applies to other particulate airborne contaminants for which a specific PEL is NOT listed unless the airborne contaminant is found to require a lower limit."]
[]
["Table 3 \"Permissible Exposure Limits (PELs) for Airborne Contaminants\""]
["Airborne contaminant ","CAS ","TWA8 ","STEL ","Ceiling ","Skin "]
["Abate (Temephos) ","3383-96-8 ","---- ","---- ","---- ","---- "]
["     Total particulate ","---- ","10 mg/m3 ","20 mg/m3 ","---- ","---- "]
["     Respirable fraction ","---- ","5 mg/m3 ","10 mg/m3 ","---- ","---- "]
["Acetaldehyde ","75-07-0 ","100 ppm ","150 ppm ","---- ","---- "]
["Acetic acid ","64-19-7 ","10 ppm ","20 ppm ","---- ","---- "]
["Acetic anhydride ","108-24-7 ","---- ","---- ","5 ppm ","---- "]
["Actinolite (asbestiform) (as asbestos)","---- ","0.1 f/cc ","1.0 f/cc (30 minutes) ","---- ","---- "]
["     (see WAC 296-62-077 and"]
["     chapter 296-65 WAC) "]
["Acetone ","67-64-1 ","750 ppm ","1,000 ppm ","---- ","---- "]
["Acetonitrile ","75-05-8 ","40 ppm ","60 ppm ","---- ","---- "]
["2-Acetylaminofluorene","53-96-3 ","---- ","---- ","---- ","---- "]
["     (see WAC 296-62-073) "]
["Acetylene ","74-86-2 ","Simple asphyxiant ","---- ","---- ","---- "]
["Acetylene dichloride","540-59-0 ","200 ppm ","250 ppm ","---- ","---- "]
["     (1,2-Dichloroethylene) "]
["Acetylene tetrabromide ","79-27-6 ","1 ppm ","3 ppm ","---- ","---- "]
["Acetylsalicylic acid","50-78-2 ","5 mg/m3 ","10 mg/m3 ","---- ","---- "]
["     (Aspirin) "]
["Acrolein ","107-02-8 ","0.1 ppm ","0.3 ppm ","---- ","---- "]
["Acrylamide ","79-06-1 ","0.03 mg/m3 ","0.09 mg/m3 ","---- ","X  "]
["Acrylic acid ","79-10-7 ","10 ppm ","20 ppm ","---- ","X  "]
["Acrylonitrile (Vinyl cyanide)","107-13-1 ","2 ppm ","10 ppm ","---- ","---- "]
["     (see WAC 296-62-07336) "]
["Aldrin ","309-00-2 ","0.25 mg/m3 ","0.75 mg/m3 ","---- ","X  "]
["Allyl alcohol ","107-18-6 ","2 ppm ","4 ppm ","---- ","X  "]
["Allyl chloride ","107-05-1 ","1 ppm ","2 ppm ","---- ","---- "]
["Allyl glycidyl ether (AGE) ","106-92-3 ","5 ppm ","10 ppm ","---- ","---- "]
["Allyl propyl disulfide ","2179-59-1 ","2 ppm ","3 ppm ","---- ","---- "]
["alpha-Alumina","1344-28-1 ","---- ","---- ","---- ","---- "]
["     (Aluminum oxide) "]
["     Total particulate ","---- ","10 mg/m3 ","20 mg/m3 ","---- ","---- "]
["     Respirable fraction ","---- ","5 mg/m3 ","10 mg/m3 ","---- ","---- "]
["Aluminum (as Al) ","7429-90-5 ","---- ","---- ","---- ","---- "]
["     Total particulate ","---- ","10 mg/m3 ","20 mg/m3 ","---- ","---- "]
["     Respirable fraction ","---- ","5 mg/m3 ","10 mg/m3 ","---- ","---- "]
["     Pyro powders ","---- ","5 mg/m3 ","10 mg/m3 ","---- ","---- "]
["     Welding fumes ","---- ","5 mg/m3 ","10 mg/m3 ","---- ","---- "]
["     Soluble salts ","---- ","2 mg/m3 ","4 mg/m3 ","---- ","---- "]
["     Alkyls (NOC) ","---- ","2 mg/m3 ","4 mg/m3 ","---- ","---- "]
["Aluminum oxide (Alundum,","7429-90-5 ","---- ","---- ","---- ","---- "]
["     Corundum) "]
["     Total particulate ","---- ","10 mg/m3 ","20 mg/m3 ","---- ","---- "]
["     Respirable fraction ","---- ","5 mg/m3 ","10 mg/m3 ","---- ","---- "]
["4-Aminodiphenyl","92-67-1 ","---- ","---- ","---- ","---- "]
["     (see WAC 296-62-073) "]
["2-Aminoethanol","141-43-5 ","3 ppm ","6 ppm ","---- ","---- "]
["     (Ethanolamine) "]
["2-Aminopyridine ","504-29-0 ","0.5 ppm ","1.5 ppm ","---- ","---- "]
["Amitrole ","61-82-5 ","0.2 mg/m3 ","0.6 mg/m3 ","---- ","---- "]
["Ammonia ","7664-41-7 ","25 ppm ","35 ppm ","---- ","---- "]
["Ammonium chloride, fume ","12125-02-9 ","10 mg/m3 ","20 mg/m3 ","---- ","---- "]
["Ammonium sulfamate (Ammate) ","7773-06-0 ","---- ","---- ","---- ","---- "]
["     Total particulate ","---- ","10 mg/m3 ","20 mg/m3 ","---- ","---- "]
["     Respirable fraction ","---- ","5.0 mg/m3 ","10 mg/m3 ","---- ","---- "]
["Amosite (as asbestos)","---- ","0.1 f/cc ","1.0 f/cc (30 minutes) ","---- ","---- "]
["     (see WAC 296-62-077 and"]
["     and chapter 296-65 WAC) "]
["n-Amyl acetate ","628-63-7 ","100 ppm ","150 ppm ","---- ","---- "]
["sec-Amyl acetate ","626-38-0 ","125 ppm ","156 ppm ","---- ","---- "]
["Aniline and homologues ","62-53-3 ","2 ppm ","4 ppm ","---- ","X  "]
["Anisidine (o, p-isomers) ","29191-52-4 ","0.1 ppm ","0.3 ppm ","---- ","X  "]
["Anthophyllite (asbestiform) (as","---- ","0.1 f/cc ","1.0 f/cc (30 minutes) ","---- ","---- "]
["     asbestos)"]
["     (see WAC 296-62-077 and"]
["     chapter 296-65 WAC) "]
["Antimony and compounds (as Sb) ","7440-36-0 ","0.5 mg/m3 ","1.5 mg/m3 ","---- ","---- "]
["ANTU","86-88-4 ","0.3 mg/m3 ","0.9 mg/m3 ","---- ","---- "]
["     (alpha Naphthyl thiourea) "]
["Argon ","7440-37-1 ","Simple asphyxiant ","---- ","---- ","---- "]
["Arsenic,","7440-38-2 ","0.2 mg/m3 ","0.6 mg/m3 ","---- ","---- "]
["     organic compounds (as As) "]
["Arsenic, inorganic","7440-38-2 ","0.01 mg/m3 ","---- ","---- ","---- "]
["     compounds (as As) (when"]
["     use is covered by chapter"]
["     296-848 WAC) "]
["Arsenic, inorganic","7440-38-2 ","0.2 mg/m3 ","0.6 mg/m3 ","---- ","---- "]
["     compounds (as As)"]
["     (when use is not"]
["     covered by chapter"]
["     296-848 WAC) "]
["Arsine ","7784-42-1 ","0.05 ppm ","0.15 ppm ","---- ","---- "]
["Asbestos","---- ","0.1 f/cc ","1.0 f/cc (30 minutes) ","---- ","---- "]
["     (see WAC 296-62-077"]
["     and chapter 296-65 WAC) "]
["Asphalt (Petroleum fumes) ","8052-42-4 ","5 mg/m3 ","10 mg/m3 ","---- ","---- "]
["Atrazine ","1912-24-9 ","5 mg/m3 ","10 mg/m3 ","---- ","---- "]
["Azinphos methyl (Guthion) ","86-50-0 ","0.2 mg/m3 ","0.6 mg/m3 ","---- ","X  "]
["Azodrin (Monocrotophos) ","6923-22-4 ","0.25 mg/m3 ","0.75 mg/m3 ","---- ","---- "]
["Barium, soluble","7440-39-3 ","0.5 mg/m3 ","1.5 mg/m3 ","---- ","---- "]
["     compounds (as Ba) "]
["Barium sulfate ","7727-43-7 ","---- ","---- ","---- ","---- "]
["     Total particulate ","---- ","10 mg/m3 ","20 mg/m3 ","---- ","---- "]
["     Respirable fraction ","---- ","5 mg/m3 ","10 mg/m3 ","---- ","---- "]
["Baygon (Propoxur) ","114-26-1 ","0.5 mg/m3 ","1.5 mg/m3 ","---- ","---- "]
["Benomyl ","17804-35-2 ","---- ","---- ","---- ","---- "]
["     Total particulate ","---- ","10 mg/m3 ","20 mg/m3 ","---- ","---- "]
["     Respirable fraction ","---- ","5 mg/m3 ","10 mg/m3 ","---- ","---- "]
["Benzene","71-43-2 ","1 ppm ","5 ppm ","---- ","---- "]
["     (see chapter 296-849 WAC) "]
["Benzidine","92-87-5 ","---- ","---- ","---- ","---- "]
["     (see WAC 296-62-073) "]
["p-Benzoquinone","106-51-4 ","0.1 ppm ","0.3 ppm ","---- ","---- "]
["     (Quinone) "]
["Benzo(a) pyrene","65996-93-2 ","0.2 mg/m3 ","0.6 mg/m3 ","---- ","---- "]
["     (Coal tar pitch volatiles) "]
["Benzoyl peroxide ","94-36-0 ","5 mg/m3 ","10 mg/m3 ","---- ","---- "]
["Benzyl chloride ","100-44-7 ","1ppm ","3 ppm ","---- ","---- "]
["Beryllium and beryllium","7440-41-7 ","0.002 mg/m3 ","0.005 mg/m3","0.025 mg/m3 ","---- "]
["     compounds (as Be) ",null,null,"(30 min.) "]
["Biphenyl (Diphenyl) ","92-52-4 ","0.2 ppm ","0.6 ppm ","---- ","---- "]
["Bismuth telluride, undoped ","1304-82-1 ","---- ","---- ","---- ","---- "]
["     Total particulate ","---- ","10 mg/m3 ","20 mg/m3 ","---- ","---- "]
["     Respirable fraction ","---- ","5 mg/m3 ","10 mg/m3 ","---- ","---- "]
["Bismuth telluride, Se-doped ","---- ","5 mg/m3 ","10 mg/m3 ","---- ","---- "]
["Borates, tetra, sodium salts ","---- ","---- ","---- ","---- ","---- "]
["     Anhydrous ","1330-43-4 ","1 mg/m3 ","3 mg/m3 ","---- ","---- "]
["     Decahydrate ","1303-96-4 ","5 mg/m3 ","10 mg/m3 ","---- ","---- "]
["     Pentahydrate ","12179-04-3 ","1 mg/m3 ","3 mg/m3 ","---- ","---- "]
["Boron oxide ","1303-86-2 ","---- ","---- ","---- ","---- "]
["     Total particulate ","---- ","10 mg/m3 ","20 mg/m3 ","---- ","---- "]
["Boron tribromide ","10294-33-4 ","---- ","---- ","1 ppm ","---- "]
["Boron trifluoride ","6737-07-2 ","---- ","---- ","1 ppm ","---- "]
["Bromacil ","314-40-9 ","1 ppm ","3 ppm ","---- ","---- "]
["Bromine ","7726-95-6 ","0.1 ppm ","0.3 ppm ","---- ","---- "]
["Bromine pentafluoride ","7789-30-2 ","0.1 ppm ","0.3 ppm ","---- ","---- "]
["Bromochloromethane","74-97-5 ","200 ppm ","250 ppm ","---- ","---- "]
["     (Chlorobromomthane) "]
["Bromoform ","15-25-2 ","0.5 ppm ","1.5 ppm ","---- ","X  "]
["Butadiene","106-99-0 ","1 ppm ","5 ppm ","---- ","---- "]
["     (1,3-butadiene)"]
["     (see WAC 296-62-07460) "]
["Butane ","106-97-8 ","800 ppm ","1,000 ppm ","---- ","---- "]
["Butanethiol","109-79-5 ","0.5 ppm ","1.5 ppm ","---- ","---- "]
["     (Butyl mercaptan) "]
["2-Butanone","78-93-3 ","200 ppm ","300 ppm ","---- ","---- "]
["     (Methyl ethyl ketone) "]
["2-Butoxy ethanol","111-76-2 ","25 ppm ","38 ppm ","---- ","X  "]
["     (Butyl cellosolve) "]
["n-Butyl acetate ","123-86-4 ","150 ppm ","200 ppm ","---- ","---- "]
["sec-Butyl acetate ","105-46-4 ","200 ppm ","250 ppm ","---- ","---- "]
["tert-Butyl acetate ","540-88-5 ","200 ppm ","250 ppm ","---- ","---- "]
["Butyl acrylate ","141-32-2 ","10 ppm ","20 ppm ","---- ","---- "]
["n-Butyl alcohol ","71-36-3 ","---- ","---- ","50 ppm ","X  "]
["sec-Butyl alcohol ","78-92-2 ","100 ppm ","150 ppm ","-- -- ","---- "]
["tert-Butyl alcohol ","75-65-0 ","100 ppm ","150 ppm ","---- ","---- "]
["Butylamine ","109-73-9 ","---- ","---- ","5 ppm ","X  "]
["Butyl cellosolve (2-Butoxy ethanol) ","111-76-2 ","25 ppm ","38 ppm ","---- ","---- "]
["tert-Butyl chromate","1189-85-1 ","0.005 mg/m3 ","---- ","0.1 mg/m3 ","X  "]
["     (as Cr)"]
["     (see WAC 296-62-08003) "]
["n-Butyl glycidyl ether (BGE) ","2426-08-6 ","25 ppm ","38 ppm ","---- ","---- "]
["n-Butyl lactate ","138-22-7 ","5 ppm ","10 ppm ","--- ","---- "]
["Butyl mercaptan ","109-79-5 ","0.5 ppm ","1.5 ppm ","---- ","---- "]
["o-sec-Butylphenol ","89-72-5 ","5 ppm ","10 ppm ","---- ","X  "]
["p-tert-Butyl-toluene ","98-51-1 ","10 ppm ","20 ppm ","---- ","---- "]
["Cadmium oxide fume (as Cd)","1306-19-0 ","0.005 mg/m3 ","---- ","-- -- ","---- "]
["     (see WAC 296-62-074"]
["     and 296-155-174) "]
["Cadmium dust and salts (as Cd)","7440-43-9 ","0.005 mg/m3 ","---- ","---- ","---- "]
["     (see WAC 296-62-074"]
["     and 296-155-174) "]
["Calcium arsenate","---- ","0.01 mg/m3 ","---- ","---- ","---- "]
["     (see chapter 296-848 WAC) "]
["Calcium carbonate ","1317-65-3 ","---- ","---- ","---- ","---- "]
["     Total particulate ","---- ","10 mg/m3 ","20 mg/m3 ","---- ","---- "]
["     Respirable fraction ","---- ","5 mg/m3 ","10 mg/m3 ","---- ","---- "]
["Calcium cyanamide ","156-62-7 ","0.5 mg/m3 ","1.5 mg/m3 ","---- ","---- "]
["Calcium hydroxide ","1305-62-0 ","5 mg/m3 ","10 mg/m3 ","---- ","---- "]
["Calcium oxide ","1305-78-8 ","2 mg/m3 ","4 mg/m3 ","---- ","---- "]
["Calcium silicate ","1344-95-2 ","---- ","---- ","---- ","---- "]
["     Total particulate ","---- ","10 mg/m3 ","20 mg/m3 ","---- ","---- "]
["     Respirable fraction ","---- ","5 mg/m3 ","10 mg/m3 ","---- ","---- "]
["Calcium sulfate ","7778-18-9 ","---- ","---- ","---- ","---- "]
["     Total particulate ","---- ","10 mg/m3 ","20 mg/m3 ","---- ","---- "]
["     Respirable fraction ","---- ","5 mg/m3 ","10 mg/m3 ","---- ","---- "]
["Camphor (synthetic) ","76-22-2 ","2 mg/m3 ","4 mg/m3 ","---- ","---- "]
["Caprolactam ","105-60-2 ","---- ","---- ","---- ","---- "]
["     Dust ","---- ","1 mg/m3 ","3 mg/m3 ","---- ","---- "]
["     Vapor ","---- ","5 ppm ","10 ppm ","---- ","---- "]
["Captafol","2425-06-1 ","0.1 mg/m3 ","0.3 mg/m3 ","---- ","X  "]
["     (Difolatan) "]
["Captan ","133-06-2 ","5 mg/m3 ","10 mg/m3 ","---- ","---- "]
["Carbaryl (Sevin) ","63-25-2 ","5 mg/m3 ","10 mg/m3 ","---- ","---- "]
["Carbofuran (Furadon) ","1563-66-2 ","0.1 mg/m3 ","0.3 mg/m3 ","---- ","---- "]
["Carbon black ","1333-86-4 ","3.5 mg/m3 ","7 mg/m3 ","---- ","---- "]
["Carbon dioxide ","124-38-9 ","5,000 ppm ","30,000 ppm ","---- ","---- "]
["Carbon disulfide ","75-15-0 ","4 ppm ","12 ppm ","---- ","X  "]
["Carbon monoxide ","630-08-0 ","35 ppm ","200 ppm (5 min.) ","1,500 ppm ","---- "]
["Carbon tetrabromide ","558-13-4 ","0.1 ppm ","0.3 ppm ","---- ","---- "]
["Carbon tetrachloride","56-23-5 ","2 ppm ","4 ppm ","---- ","X "]
["     (Tetrachloromethane) "]
["Carbonyl chloride","7803-51-2 ","0.1 ppm ","0.3 ppm ","---- ","---- "]
["     (Phosgene) "]
["Carbonyl fluoride ","353-50-4 ","2 ppm ","5 ppm ","---- ","---- "]
["Catechol (Pyrocatechol) ","120-80-9 ","5 ppm ","10 ppm ","---- ","X  "]
["Cellosolve acetate","111-15-9 ","5 ppm ","10 ppm ","---- ","X "]
["     (2-Ethoxyethylacetate) "]
["Cellulose (paper fiber) ","9004-34-6 ","---- ","---- ","---- ","---- "]
["     Total particulate ","---- ","10 mg/m3 ","20 mg/m3 ","---- ","---- "]
["     Respirable fraction ","---- ","5 mg/m3 ","10 mg/m3 ","---- ","---- "]
["Cesium hydroxide ","21351-79-1 ","2 mg/m3 ","4 mg/m3 ","---- ","---- "]
["Chlordane ","57-74-9 ","0.5 mg/m3 ","1.5 mg/m3 ","---- ","X  "]
["Chlorinated camphene","8001-35-2 ","0.5 mg/m3 ","1 mg/m3 ","---- ","X  "]
["     (Toxaphen) "]
["Chlorinated diphenyl oxide ","55720-99-5 ","0.5 mg/m3 ","1.5 mg/m3 ","---- ","---- "]
["Chlorine ","7782-50-5 ","0.5 ppm ","---- ","1 ppm ","---- "]
["Chlorine dioxide ","10049-04-4 ","0.1 ppm ","0.3 ppm ","---- ","---- "]
["Chlorine trifluoride ","7790-91-2 ","---- ","---- ","0.1 ppm ","---- "]
["Chloroacetaldehyde ","107-20-0 ","---- ","---- ","1 ppm ","---- "]
["a-Chloroacetophenone","532-21-4 ","0.05 ppm ","0.15 ppm ","---- ","---- "]
["     (Phenacyl chloride) "]
["Chloroacetyl chloride ","79-04-9 ","0.05 ppm ","0.15 ppm ","---- ","---- "]
["Chlorobenzene","108-90-7 ","75 ppm ","113 ppm ","---- ","---- "]
["     (Monochlorobenzene) "]
["o-Chlorobenzylidene","2698-41-1 ","---- ","---- ","0.05 ppm ","X  "]
["     malononitrile (OCBM) "]
["Chlorobromomethane ","74-97-5 ","200 ppm ","250 ppm ","---- ","---- "]
["2-Chloro-1, 3-butadiene","126-99-8 ","10 ppm ","20 ppm ","---- ","X "]
["     (beta-Chloroprene) "]
["Chlorodifluoromethane ","75-45-6 ","1,000 ppm ","1,250 ppm ","---- ","---- "]
["Chlorodiphenyl","53469-21-9 ","1 mg/m3 ","3 mg/m3 ","---- ","X  "]
["     (42% Chlorine) (PCB)"]
["     (Polychlorobiphenyls) "]
["Chlorodiphenyl","11097-69-1 ","0.5 mg/m3 ","1.5 mg/m3 ","---- ","X  "]
["     (54% Chlorine)"]
["     (Polychlorobiphenyls"]
["     (PCB)) "]
["1-Chloro-2, 3-epoxypropane","106-89-8 ","2 ppm ","4 ppm ","---- ","X "]
["     (Epichlorhydrin) "]
["2-Chloroethanol","107-07-3 ","---- ","---- ","1 ppm ","X "]
["     (Ethylene chlorohydrin) "]
["Chloroethylene","75-01-4 ","1 ppm ","5 ppm ","---- ","---- "]
["     (vinyl chloride)"]
["     (See WAC 296-62-07329) "]
["Chloroform (Trichloromethane) ","67-66-3 ","2 ppm ","4 ppm ","---- ","---- "]
["1-Chloro-1-nitropropane ","600-25-9 ","2 ppm ","4 ppm ","---- ","---- "]
["bis-Chloromethyl ether","542-88-1 ","---- ","---- ","---- ","---- "]
["     (see WAC 296-62-073) "]
["Chloromethyl methyl ether","107-30-2 ","---- ","---- ","---- ","---- "]
["     (Methyl chloromethyl"]
["     ether)"]
["     (see WAC 296-62-073) "]
["Chloropentafluoroethane ","76-15-3 ","1,000 ppm ","1,250 ppm ","---- ","---- "]
["Chloropicrin (Nitrotrichloromethane) ","76-06-2 ","0.1 ppm ","0.3 ppm ","---- ","---- "]
["beta-Chloroprene (2-Chloro-1,","126-99-8 ","10 ppm ","20 ppm ","---- ","X  "]
["     3-butadiene) "]
["o-Chlorostyrene ","2039-87-4 ","50 ppm ","75 ppm ","---- ","---- "]
["o-Chlorotoluene ","95-49-8 ","50 ppm ","75 ppm ","---- ","---- "]
["2-Chloro-6-trichloromethyl","1929-82-4 ","---- ","---- ","---- ","---- "]
["     pyridine (Nitrapyrin) "]
["     Total particulate ","---- ","10 mg/m3 ","20 mg/m3 ","---- ","---- "]
["     Respirable fraction ","---- ","5 mg/m3 ","10 mg/m3 ","---- ","---- "]
["Chlorpyrifos ","2921-88-2 ","0.2 mg/m3 ","0.6 mg/m3 ","---- ","X  "]
["Chromic acid and chromates","Varies with","---- ","---- ","0.1 mg/m3 ","---- "]
["     (as Cr)","compound "]
["     (when the compound is not"]
["     covered by WAC"]
["     296-62-08003) "]
["Chromium ","---- ","---- ","---- ","---- ","---- "]
["Chromium (VI) compounds","---- ","0.005 mg/m3 ","---- ","---- ","---- "]
["     (as Cr) (when the compound"]
["     is covered by"]
["     WAC 296-62-08003) "]
["Chromium metal","7440-47-3 ","0.5 mg/m3 ","---- ","---- ","---- "]
["     or Chromium (II) compounds"]
["     Or"]
["     Chromium (III) compounds "]
["Chromyl chloride (as Cr)","14977-61-8 ","0.005 mg/m3 ","---- ","---- ","---- "]
["     (see WAC 296-62-08003) "]
["Chrysene (Coal tar","65996-93-2 ","0.2 mg/m3 ","0.6 mg/m3 ","---- ","---- "]
["     pitch volatiles) "]
["Chrysotile (as asbestos)","---- ","0.1 f/cc ","1.0 f/cc (30 minutes) ","---- ","---- "]
["     (see WAC 296-62-077"]
["     and chapter 296-65 WAC) "]
["Clopidol ","2971-90-6 ","---- ","---- ","---- ","---- "]
["     Total particulate ","---- ","10 mg/m3 ","20 mg/m3 ","---- ","---- "]
["     Respirable fraction ","---- ","5 mg/m3 ","10 mg/m3 ","---- ","---- "]
["Coal dust (less than 5% SiO2) ","---- ","---- ","---- ","---- ","---- "]
["     Respirable fraction ","---- ","2 mg/m3 ","4 mg/m3 ","---- ","---- "]
["Coal dust (greater than or","---- ","---- ","---- ","---- ","---- "]
["     equal to 5% SiO2) "]
["     Respirable fraction ","---- ","0.1 mg/m3 ","0.3 mg/m3 ","---- ","---- "]
["Coal tar pitch volatiles","65996-93-2 ","0.2 mg/m3 ","0.6 mg/m3 ","---- ","---- "]
["     (benzene soluble fraction)"]
["     Acridine"]
["     Anthracene"]
["     Benzo (a) pyrene"]
["     Chrysene"]
["     Phenanthrene"]
["     Pyrene "]
["Cobalt, metal fume & dust","7440-48-4 ","0.05 mg/m3 ","0.15 mg/m3 ","---- ","---- "]
["     (as Co) "]
["Cobalt carbonyl (as Co) ","10210-68-1 ","0.1 mg/m3 ","0.3 mg/m3 ","---- ","---- "]
["Cobalt hydrocarbonyl (as Co) ","16842-03-8 ","0.1 mg/m3 ","0.3 mg/m3 ","---- ","---- "]
["Coke oven emissions","---- ","0.15 mg/m3 ","---- ","---- ","---- "]
["     (see WAC 296-62-200) "]
["Copper (as Cu) ","7440-50-8 ","---- ","---- ","---- ","---- "]
["     Fume ","---- ","0.1 mg/m3 ","0.3 mg/m3 ","---- ","---- "]
["Dusts and mists ","---- ","1 mg/m3 ","3 mg/m3 ","---- ","---- "]
["Cotton dust (raw) (waste sorting, blending, cleaning, willowing and garetting) (see WAC 296-62-14533) ","---- ","1 mg/m3 ","---- ","---- ","---- "]
["Corundum (Aluminum oxide) ","7429-90-5 ","---- ","---- ","---- ","---- "]
["     Total particulate ","---- ","10 mg/m3 ","20 mg/m3 ","---- ","---- "]
["     Respirable fraction ","---- ","5 mg/m3 ","10 mg/m3 ","---- ","---- "]
["Crag herbicide (Sesone, Sodium-2,","136-78-7 ","---- ","---- ","---- ","---- "]
["     4-dichloro-phenoxyethyl"]
["     sulfate) "]
["     Total particulate ","---- ","10 mg/m3 ","20 mg/m3 ","---- ","---- "]
["     Respirable fraction ","---- ","5 mg/m3 ","10 mg/m3 ","---- ","---- "]
["Cresol (all isomers) ","1319-77-3 ","5 ppm ","10 ppm ","---- ","X  "]
["Crocidolite (as asbestos)","---- ","0.1 f/cc ","1.0 f/cc (30 minutes) ","---- ","---- "]
["     (see WAC 296-62-077 and"]
["     chapter 296-65 WAC) "]
["Crotonaldehyde","123-73-9;","2 ppm ","4 ppm ","---- ","---- "]
["      ","4170-30-3 "]
["Crufomate ","299-86-5 ","5 mg/m3 ","10 mg/m3 ","---- ","---- "]
["Cumene ","98-82-8 ","50 ppm ","75 ppm ","---- ","X  "]
["Cyanamide ","420-04-2 ","2 mg/m3 ","4 mg/m3 ","---- ","---- "]
["Cyanide (as CN) ","Varies with","5 mg/m3 ","10 mg/m3 ","---- ","X  "]
[null,"compound "]
["Cyanogen ","460-19-5 ","10 ppm ","20 ppm ","---- ","---- "]
["Cyanogen chloride ","506-77-4 ","---- ","---- ","0.3 ppm ","---- "]
["Cyclohexane ","110-82-7 ","300 ppm ","375 ppm ","---- ","---- "]
["Cyclohexanol ","108-93-0 ","50 ppm ","75 ppm ","---- ","X  "]
["Cyclohexanone ","108-94-1 ","25 ppm ","38 ppm ","---- ","X  "]
["Cyclohexene ","110-83-8 ","300 ppm ","375 ppm ","---- ","---- "]
["Cyclohexylamine ","108-91-8 ","10 ppm ","20 ppm ","---- ","---- "]
["Cyclonite (RDX) ","121-82-4 ","1.5 mg/m3 ","3.0 mg/m3 ","---- ","X  "]
["Cyclopentadiene ","542-92-7 ","75 ppm ","113 ppm ","---- ","---- "]
["Cyclopentane ","287-92-3 ","600 ppm ","750 ppm ","---- ","---- "]
["Cyhexatin (Tricyclohexyltin","13121-70-5 ","5 mg/m3 ","10 mg/m3 ","---- ","---- "]
["     hydroxide) "]
["2,4-D (Dichlorophenoxy-","94-75-7 ","10 mg/m3 ","20 mg/m3 ","---- ","---- "]
["     acetic acid) "]
["DBCP (1,2-Dibromo-3-","96-12-8 ","0.001 ppm ","---- ","0.005 ppm ","---- "]
["     chloropropane)"]
["     (See WAC 296-62-07342) "]
["DDT (Dichlorodiphenyltri-","50-29-3 ","1 mg/m3 ","3 mg/m3 ","---- ","X  "]
["     chloroethane) "]
["DDVP, (Dichlorvos) ","62-73-7 ","0.1 ppm ","0.3 ppm ","---- ","X  "]
["Dasanit","115-90-2 ","0.1 mg/m3 ","0.3 mg/m3 ","---- ","---- "]
["     (Fensulfothion) "]
["Decaborane ","17702-41-9 ","0.05 ppm ","0.15 ppm ","---- ","X  "]
["Demeton ","8065-48-3 ","0.01 ppm ","0.03 ppm ","---- ","X  "]
["Diacetone alcohol","123-42-2 ","50 ppm ","75 ppm ","---- ","---- "]
["     (4-hydroxy-4-methyl-"]
["     2-pentanone) "]
["1, 2-Diaminoethane","107-15-3 ","10 ppm ","20 ppm ","---- ","---- "]
["     (Ethylenediamine) "]
["Diazinon ","333-41-5 ","0.1 mg/m3 ","0.3 mg/m3 ","---- ","X  "]
["Diazomethane ","334-88-3 ","0.2 ppm ","0.6 ppm ","---- ","---- "]
["Diborane ","19287-45-7 ","0.1 ppm ","0.3 ppm ","---- ","---- "]
["Dibrom (see Naled) ","300-76-5 ","3 mg/m3 ","6 mg/m3 ","---- ","X "]
["1, 2-Dibromo-3-chloropropane","96-12-8 ","0.001 ppm ","---- ","0.005 ppm ","---- "]
["     (DBCP)"]
["     (see WAC"]
["     296-62-07342) "]
["2-N-Dibutylamino ethanol ","102-81-8 ","2 ppm ","4 ppm ","---- ","X  "]
["Dibutyl phosphate ","107-66-4 ","1 ppm ","2 ppm ","---- ","---- "]
["Dibutyl phthalate ","84-74-2 ","5 mg/m3 ","10 mg/m3 ","---- ","---- "]
["Dichloroacetylene ","7572-29-4 ","---- ","----- ","0.1 ppm ","---- "]
["o-Dichlorobenzene ","95-50-1 ","---- ","---- ","50 ppm ","---- "]
["p-Dichlorobenzene ","106-46-7 ","75 ppm ","110 ppm ","---- ","---- "]
["3, 3'-Dichlorobenzidine","91-94-1 ","---- ","---- ","---- ","---- "]
["     (see WAC 296-62-073) "]
["Dichlorodiphenyltri-","50-29-3 ","1 mg/m3 ","3 mg/m3 ","---- ","X "]
["     chloroethane (DDT) "]
["Dichlorodifluoromethane ","75-71-8 ","1,000 ppm ","1,250 ppm ","---- ","---- "]
["1, 3-Dichloro-5, 5-dimethyl","118-52-5 ","0.2 mg/m3 ","0.4 mg/m3 ","---- ","---- "]
["     hydantoin "]
["1, 1-Dichloroethane","75-34-3 ","100 ppm ","150 ppm ","---- ","---- "]
["     (Ethylidine chloride) "]
["1, 2-Dichloroethane","107-06-2 ","1 ppm ","2 ppm ","---- ","---- "]
["     (Ethylene dichloride) "]
["1, 1-Dichloroethylene","75-35-4 ","1 ppm ","3 ppm ","---- ","---- "]
["     (Vinylidene chloride) "]
["1, 2-Dichloroethylene (Acetylene","540-59-0 ","200 ppm ","250 ppm ","---- ","---- "]
["     dichloride) "]
["Dichloroethyl ether ","111-44-4 ","5 ppm ","10 ppm ","---- ","X  "]
["Dichlorofluoromethane ","75-43-4 ","10 ppm ","20 ppm ","---- ","---- "]
["Dichloromethane","75-09-2 ","25 ppm ","125 ppm ","---- ","---- "]
["     (Methylene chloride)"]
["     (See chapter 296-859 WAC) "]
["1, 1-Dichloro-1-nitroethane ","594-72-9 ","2 ppm ","10 ppm ","---- ","---- "]
["Dichlorophenoxyacetic acid","94-75-7 ","10 mg/m3 ","20 mg/m3 ","---- ","---- "]
["     (2, 4-D) "]
["1, 2-Dichloropropane","78-87-5 ","75 ppm ","110 ppm ","---- ","---- "]
["     (Propylene dichloride) "]
["Dichloropropene ","542-75-6 ","1 ppm ","3 ppm ","---- ","X  "]
["2, 2-Dichloropropionic acid ","75-99-0 ","1 ppm ","3 ppm ","---- ","---- "]
["Dichlorotetrafluoroethane ","76-14-2 ","1,000 ppm ","1,250 ppm ","---- ","---- "]
["Dichlorvos (DDVP) ","62-73-7 ","0.1 ppm ","0.3 ppm ","---- ","X  "]
["Dicrotophos ","141-66-2 ","0.25 mg/m3 ","0.75 mg/m3 ","---- ","X  "]
["Dicyclopentadiene ","77-73-6 ","5 ppm ","10 ppm ","---- ","---- "]
["Dicyclopentadienyl iron ","102-54-5 ","---- ","---- ","---- ","---- "]
["     Total particulate ","---- ","10 mg/m3 ","20 mg/m3 ","---- ","---- "]
["     Respirable fraction ","---- ","5 mg/m3 ","10 mg/m3 ","---- ","---- "]
["Dieldrin ","60-57-1 ","0.25 mg/m3 ","0.75 mg/m3 ","---- ","X  "]
["Diethanolamine ","111-42-2 ","3 ppm ","6 ppm ","---- ","---- "]
["Diethylamine ","109-89-7 ","10 ppm ","25 ppm ","---- ","---- "]
["2-Diethylaminoethanol ","100-37-8 ","10 ppm ","20 ppm ","---- ","X  "]
["Diethylene triamine ","111-40-0 ","1 ppm ","3 ppm ","---- ","X  "]
["Diethyl ether (Ethyl ether) ","60-29-7 ","400 ppm ","500 ppm ","---- ","---- "]
["Diethyl ketone ","96-22-0 ","200 ppm ","250 ppm ","---- ","---- "]
["Diethyl phthalate ","84-66-2 ","5 mg/m3 ","10 mg/m3 ","---- ","---- "]
["Difluorodibromomethane ","75-61-6 ","100 ppm ","150 ppm ","---- ","---- "]
["Difolatan (Captafol) ","2425-06-1 ","0.1 mg/m3 ","0.3 mg/m3 ","---- ","X "]
["Diglycidyl ether (DGE) ","2238-07-5 ","0.1 ppm ","0.3 ppm ","---- ","---- "]
["Dihydroxybenzene","123-31-9 ","2 mg/m3 ","4 mg/m3 ","-- -- ","---- "]
["     (Hydroquinone) "]
["Diisobutyl ketone (2, 6-","108-83-8 ","25 ppm ","38 ppm ","---- ","---- "]
["     Dimethylheptanone) "]
["Diisopropylamine ","108-18-9 ","5 ppm ","10 ppm ","---- ","X  "]
["Dimethoxymethane (Methylal) ","109-87-5 ","1,000 ppm ","1,250 ppm ","---- ","---- "]
["Dimethyl acetamide ","127-19-5 ","10 ppm ","20 ppm ","---- ","X  "]
["Dimethylamine ","124-40-3 ","10 ppm ","20 ppm ","---- ","---- "]
["4-Dimethylaminoazo benzene","60-11-7 ","---- ","---- ","---- ","---- "]
["     (see WAC 296-62-073) "]
["Dimethylaminobenzene","1300-73-8 ","2 ppm ","4 ppm ","---- ","X "]
["     (Xylidene) "]
["Dimethylaniline","121-69-7 ","5 ppm ","10 ppm ","---- ","X  "]
["     (N, N-Dimethylaniline) "]
["Dimethylbenzene (Xylene) ","1300-73-8 ","100 ppm ","150 ppm ","---- ","---- "]
["Dimethyl-1, 2-dibromo-2,","300-76-5 ","3 mg/m3 ","6 mg/m3 ","---- ","X  "]
["     2-dichloroethyl phosphate"]
["     (Naled) "]
["Dimethylformamide ","68-12-2 ","10 ppm ","20 ppm ","---- ","X  "]
["2, 6-Dimethylheptanone","108-83-8 ","25 ppm ","38 ppm ","---- ","---- "]
["     (Diisobutyl ketone) "]
["1, 1-Dimethylhydrazine ","57-14-7 ","0.5 ppm ","1.5 ppm ","---- ","X  "]
["Dimethyl phthalate ","131-11-3 ","5 mg/m3 ","10 mg/m3 ","---- ","---- "]
["Dimethyl sulfate ","77-78-1 ","0.1 ppm ","0.3 ppm ","---- ","X  "]
["Dinitolmide","148-01-6 ","5 mg/m3 ","10 mg/m3 ","---- ","---- "]
["     (3, 5-Dinitro-o-toluamide) "]
["Dinitrobenzene (all isomers -","528-29-0;","0.15 ppm ","0.45 ppm ","---- ","X  "]
["     alpha, meta and para) ","99-65-0;"]
[null,"100-25-4 "]
["Dinitro-o-cresol ","534-52-1 ","0.2 mg/m3 ","0.6 mg/m3 ","---- ","X  "]
["3, 5-Dinitro-o-toluamide","148-01-6 ","5 mg/m3 ","10 mg/m3 ","---- ","---- "]
["     (Dinitolmide) "]
["Dinitrotoluene ","25321-14-6 ","1.5 mg/m3 ","3 mg/m3 ","---- ","X  "]
["Dioxane (Diethylene dioxide) ","123-91-1 ","25 ppm ","38 ppm ","---- ","X  "]
["Dioxathion ","78-34-2 ","0.2 mg/m3 ","0.6 mg/m3 ","---- ","X  "]
["Diphenyl (Biphenyl) ","92-52-4 ","0.2 ppm ","0.6 ppm ","---- ","---- "]
["Diphenylamine ","122-39-4 ","10 mg/m3 ","20 mg/m3 ","---- ","---- "]
["Diphenylmethane diisocyanate","101-68-8 ","---- ","---- ","0.02 ppm ","---- "]
["     (Methylene bisphenyl           isocyanate (MDI)) "]
["Dipropylene glycol methyl ether ","34590-94-8 ","100 ppm ","150 ppm ","---- ","X  "]
["Dipropyl ketone ","123-19-3 ","50 ppm ","75 ppm ","---- ","---- "]
["Diquat ","85-00-7 ","0.5 mg/m3 ","1.5 mg/m3 ","---- ","---- "]
["Di-sec, Octyl phthalate","117-81-7 ","5 mg/m3 ","10 mg/m3 ","---- ","---- "]
["     (Di-2-ethylhexylphthalate) "]
["Disulfram ","97-77-8 ","2 mg/m3 ","4 mg/m3 ","---- ","---- "]
["Disulfoton ","298-04-4 ","0.1 mg/m3 ","0.3 mg/m3 ","---- ","X  "]
["2, 6-Di-tert-butyl-p-cresol ","128-37-0 ","10 mg/m3 ","20 mg/m3 ","---- ","---- "]
["Diuron ","330-54-1 ","10 mg/m3 ","20 mg/m3 ","---- ","---- "]
["Divinyl benzene ","1321-74-0 ","10 ppm ","20 ppm ","---- ","---- "]
["Emery ","12415-34-8 ","---- ","---- ","---- ","---- "]
["     Total particulate ","---- ","10 mg/m3 ","20 mg/m3 ","---- ","---- "]
["     Respirable fraction ","---- ","5 mg/m3 ","10 mg/m3 ","---- ","---- "]
["Endosulfan (Thiodan) ","115-29-7 ","0.1 mg/m3 ","0.3 mg/m3 ","---- ","X  "]
["Endrin ","72-20-8 ","0.1 mg/m3 ","0.3 mg/m3 ","---- ","X  "]
["Epichlorhydrin (1-Chloro-2,","106-89-8 ","2 ppm ","4 ppm ","---- ","X  "]
["     3-epoxypropane) "]
["EPN ","2104-64-5 ","0.5 mg/m3 ","1.5 mg/m3 ","---- ","X  "]
["1, 2-Epoxypropane","75-56-9 ","20 ppm ","30 ppm ","---- ","---- "]
["     (Propylene oxide) "]
["2, 3-Epoxy-1-propanol","556-52-5 ","25 ppm ","38 ppm ","---- ","---- "]
["     (Glycidol) "]
["Ethane ","---- ","Simple asphyxiant ","---- ","---- ","---- "]
["Ethanethiol","75-08-1 ","0.5 ppm ","1.5 ppm ","---- ","---- "]
["     (Ethyl mercaptan) "]
["Ethanol","64-17-5 ","1,000 ppm ","1,250 ppm ","---- ","---- "]
["     (Ethyl alcohol) "]
["Ethanolamine (2-Aminoethanol) ","141-43-5 ","3 ppm ","6 ppm ","---- ","---- "]
["Ethion ","563-12-2 ","0.4 mg/m3 ","1.2 mg/m3 ","---- ","X  "]
["2-Ethoxyethanol (Glycol","110-80-5 ","5 ppm ","10 ppm ","---- ","X  "]
["     monoethyl ether) "]
["2-Ethoxyethyl acetate","111-15-9 ","5 ppm ","10 ppm ","---- ","X  "]
["     (Cellosolve acetate) "]
["Ethyl acetate ","141-78-6 ","400 ppm ","500 ppm ","---- ","---- "]
["Ethyl acrylate ","140-88-5 ","5 ppm ","25 ppm ","---- ","X  "]
["Ethyl alcohol (ethanol) ","64-17-5 ","1,000 ppm ","1,250 ppm ","---- ","---- "]
["Ethylamine ","75-04-07 ","10 ppm ","20 ppm ","---- ","---- "]
["Ethyl amyl ketone","541-85-5 ","25 ppm ","38 ppm ","---- ","---- "]
["     (5-Methyl-3-hepatone) "]
["Ethyl benzene ","100-41-4 ","100 ppm ","125 ppm ","---- ","---- "]
["Ethyl bromide ","74-96-4 ","200 ppm ","250 ppm ","---- ","---- "]
["Ethyl butyl ketone","106-35-4 ","50 ppm ","75 ppm ","---- ","---- "]
["     (3-Heptanone) "]
["Ethyl chloride ","75-00-3 ","1,000 ppm ","1,250 ppm ","---- ","---- "]
["Ethylene ","74-85-1 ","Simple asphyxiant ","---- ","---- ","---- "]
["Ethylene chlorohydrin","107-07-3 ","---- ","---- ","1 ppm ","X  "]
["     (2-Chloroethanol) "]
["Ethylenediamine (1,2-","107-15-3 ","10 ppm ","20 ppm ","---- ","X  "]
["     Diaminoethane) "]
["Ethylene dibromide ","106-93-4 ","0.1 ppm ","0.5 ppm ","---- ","---- "]
["Ethylene dichloride","107-06-2 ","1 ppm ","2 ppm ","---- ","---- "]
["     (1,2-Dichloroethane) "]
["Ethylene glycol ","107-21-1 ","---- ","---- ","50 ppm ","---- "]
["Ethylene glycol dinitrate ","628-96-6 ","---- ","0.1 mg/m3 ","---- ","X  "]
["Ethylene glycol monomethyl ether","---- ","5 ppm ","10 ppm ","---- ","X  "]
["     acetate (Methyl cellosolve           acetate) "]
["Ethyleneimine","151-56-4 ","---- ","---- ","---- ","X  "]
["     (see WAC 296-62-073) "]
["Ethylene oxide","75-21-8 ","1 ppm ","5 ppm ","---- ","---- "]
["     (see chapter 296-855 WAC) "]
["Ethyl ether (Diethyl ether) ","60-29-7 ","400 ppm ","500 ppm ","---- ","---- "]
["Ethyl formate ","109-94-4 ","100 ppm ","125 ppm ","---- ","---- "]
["Ethylidine chloride","107-06-2 ","1 ppm ","2 ppm ","---- ","---- "]
["     (1, 1-Dichloroethane) "]
["Ethylidene norbornene ","16219-75-3 ","---- ","---- ","5.0 ppm ","---- "]
["Ethyl mercaptan (Ethanethiol) ","75-08-1 ","0.5 ppm ","1.5 ppm ","---- ","---- "]
["n-Ethylmorpholine ","100-74-3 ","5 ppm ","10 ppm ","---- ","X  "]
["Ethyl sec-amyl ketone","541-85-5 ","25 ppm ","38 ppm ","---- ","---- "]
["     (5-methyl-3-heptanone) "]
["Ethyl silicate ","78-10-4 ","10 ppm ","20 ppm ","---- ","---- "]
["Fenamiphos ","22224-92-6 ","0.1 mg/m3 ","0.3 mg/m3 ","---- ","X  "]
["Fensulfothion (Dasanit) ","115-90-2 ","0.1 mg/m3 ","0.3 mg/m3 ","---- ","---- "]
["Fenthion ","55-38-9 ","0.2 mg/m3 ","0.6 mg/m3 ","---- ","X  "]
["Ferbam ","---- ","---- ","---- ","---- ","---- "]
["     Total particulate ","14484-64-1 ","10 mg/m3 ","20 mg/m3 ","---- ","---- "]
["Ferrovanadium dust ","12604-58-9 ","1 mg/m3 ","3 mg/m3 ","---- ","---- "]
["Fluorides (as F) ","Varies with","2.5 mg/m3 ","5 mg/m3 ","---- ","---- "]
[null,"compound "]
["Fluorine ","7782-41-4 ","0.1 ppm ","0.3 ppm ","---- ","---- "]
["Fluorotrichloromethane","75-69-4 ","---- ","---- ","1,000 ppm ","---- "]
["     (see Trichlorofluoro methane) "]
["Fonofos ","944-22-9 ","0.1 mg/m3 ","0.3 mg/m3 ","---- ","X  "]
["Formaldehyde","50-00-0 ","0.75 ppm ","2 ppm ","---- ","---- "]
["     (see chapter 296-856 WAC) "]
["Formamide ","75-12-7 ","20 ppm ","30 ppm ","---- ","---- "]
["Formic acid ","64-18-6 ","5 ppm ","10 ppm ","---- ","---- "]
["Furadon","1563-66-2 ","0.1 mg/m3 ","0.3 mg/m3 ","---- ","---- "]
["     (carbofuran) "]
["Furfural ","98-01-1 ","2 ppm ","4 ppm ","---- ","X  "]
["Furfuryl alcohol ","98-00-0 ","10 ppm ","15 ppm ","---- ","X  "]
["Gasoline ","8006-61-9 ","300 ppm ","500 ppm ","---- ","---- "]
["Germanium tetrahydride ","7782-65-2 ","0.2 ppm ","0.6 ppm ","---- ","---- "]
["Glass, fibrous or dust ","---- ","10 mg/m3 ","20 mg/m3 ","---- ","---- "]
["Glutaraldehyde ","111-30-8 ","---- ","---- ","0.2 ppm ","---- "]
["Glycerin mist ","56-81-5 ","---- ","---- ","---- ","---- "]
["     Total particulate ","---- ","10 mg/m3 ","20 mg/m3 ","---- ","---- "]
["     Respirable fraction ","---- ","5 mg/m3 ","10 mg/m3 ","---- ","---- "]
["Glycidol","556-52-5 ","25 ppm ","38 ppm ","---- ","---- "]
["     (2, 3-Epoxy-1-propanol) "]
["Glycol monoethyl ether","110-80-5 ","5 ppm ","10 ppm ","---- ","X "]
["     (2-Ethoxyethanol) "]
["Grain dust (oat, wheat, barley) ","---- ","10 mg/m3 ","20 mg/m3 ","---- ","---- "]
["Graphite, natural ","7782-42-5 ","---- ","---- ","---- ","---- "]
["     Respirable particulate ","---- ","2.5 mg/m3 ","5 mg/m3 ","---- ","---- "]
["Graphite, synthetic ","---- ","---- ","---- ","---- ","---- "]
["     Total particulate ","---- ","10 mg/m3 ","20 mg/m3 ","---- ","---- "]
["     Respirable fraction ","---- ","5 mg/m3 ","10 mg/m3 ","---- ","---- "]
["Guthion","86-50-0 ","0.2 mg/m3 ","0.6 mg/m3 ","---- ","X "]
["     (Azinphosmethyl) "]
["Gypsum ","13397-24-5 ","---- ","---- ","---- ","---- "]
["     Total particulate ","---- ","10 mg/m3 ","20 mg/m3 ","---- ","---- "]
["     Respirable fraction ","---- ","5 mg/m3 ","10 mg/m3 ","---- ","---- "]
["Hafnium ","7440-58-6 ","0.5 mg/m3 ","1.5 mg/m3 ","---- ","---- "]
["Helium ","---- ","Simple asphyxiant ","---- ","---- ","---- "]
["Heptachlor ","76-44-8 ","0.5 mg/m3 ","1.5 mg/m3 ","---- ","X  "]
["Heptane (n-heptane) ","142-82-5 ","400 ppm ","500 ppm ","---- ","---- "]
["2-Heptanone","110-43-0 ","50 ppm ","75 ppm ","---- ","---- "]
["     (Methyl n-amyl ketone) "]
["3-Heptanone","106-35-4 ","50 ppm ","75 ppm ","---- ","---- "]
["     (Ethyl butyl ketone) "]
["Hexachlorobutadiene ","87-68-3 ","0.02 ppm ","0.06 ppm ","---- ","X  "]
["Hexachlorocyclopentadiene ","77-47-4 ","0.01 ppm ","0.03 ppm ","---- ","---- "]
["Hexachloroethane ","67-72-1 ","1 ppm ","3 ppm ","---- ","X  "]
["Hexachloronaphthalene ","1335-87-1 ","0.2 mg/m3 ","0.6 mg/m3 ","---- ","X  "]
["Hexafluoroacetone ","684-16-2 ","0.1 ppm ","0.3 ppm ","---- ","X  "]
["Hexane ","---- ","---- ","---- ","---- ","---- "]
["     n-hexane ","110-54-3 ","50 ppm ","75 ppm ","---- ","---- "]
["     other isomers ","Varies with","500 ppm ","1,000 ppm ","---- ","---- "]
[null,"compound "]
["2-Hexanone","591-78-6 ","5 ppm ","10 ppm ","---- ","---- "]
["     (Methyl-n-butyl ketone) "]
["Hexone","108-10-1 ","50 ppm ","75 ppm ","---- ","---- "]
["     (Methyl isobutyl ketone) "]
["sec-Hexyl acetate ","108-84-9 ","50 ppm ","75 ppm ","---- ","---- "]
["Hexylene glycol ","107-41-5 ","---- ","---- ","25 ppm ","---- "]
["Hydrazine ","302-01-2 ","0.1 ppm ","0.3 ppm ","---- ","X  "]
["Hydrogen ","---- ","Simple asphyxiant ","---- ","---- ","---- "]
["Hydrogenated terphenyls ","61788-32-7 ","0.5 ppm ","1.5 ppm ","---- ","---- "]
["Hydrogen bromide ","10035-10-6 ","---- ","---- ","3.0 ppm ","---- "]
["Hydrogen chloride ","7647-01-0 ","---- ","---- ","5.0 ppm ","---- "]
["Hydrogen cyanide ","74-90-8 ","---- ","4.7 ppm ","---- ","X  "]
["Hydrogen fluoride ","7664-39-3 ","---- ","---- ","3 ppm ","---- "]
["Hydrogen peroxide ","7722-84-1 ","1 ppm ","3 ppm ","---- ","---- "]
["Hydrogen selenide (as Se) ","7783-07-5 ","0.05 ppm ","0.15 ppm ","---- ","---- "]
["Hydrogen sulfide ","7783-06-4 ","10 ppm ","15 ppm ","---- ","---- "]
["Hydroquinone","123-31-9 ","2 mg/m3 ","4 mg/m3 ","---- ","---- "]
["     (Dihydroxybenzene) "]
["4-Hydroxy-4-methyl-2-pentanone","123-42-2 ","50 ppm ","75 ppm ","---- ","---- "]
["     (Diacetone alcohol) "]
["2-Hydroxypropyl acrylate ","99-61-1 ","0.5 ppm ","1.5 ppm ","---- ","X  "]
["Indene ","95-13-6 ","10 ppm ","20 ppm ","---- ","---- "]
["Indium and compounds (as In) ","7440-74-6 ","0.1 mg/m3 ","0.3 mg/m3 ","---- ","---- "]
["Iodine ","7553-56-2 ","---- ","---- ","0.1 ppm ","---- "]
["Iodoform ","75-47-8 ","0.6 ppm ","1.8 ppm ","---- ","---- "]
["Iron oxide dust and fume (as Fe) ","1309-37-1 ","---- ","---- ","---- ","---- "]
["     Total particulate ","---- ","5 mg/m3 ","10 mg/m3 ","---- ","---- "]
["Iron pentacarbonyl (as Fe) ","13463-40-6 ","0.1 ppm ","0.2 ppm ","---- ","---- "]
["Iron salts, soluble (as Fe) ","Varies with","1 mg/m3 ","3 mg/m3 ","---- ","---- "]
[null,"compound "]
["Isoamyl acetate ","123-92-2 ","100 ppm ","150 ppm ","---- ","---- "]
["Isoamyl alcohol","123-51-3 ","100 ppm ","125 ppm ","---- ","---- "]
["     (primary and secondary) "]
["Isobutyl acetate ","110-19-0 ","150 ppm ","188 ppm ","---- ","---- "]
["Isobutyl alcohol ","78-83-1 ","50 ppm ","75 ppm ","---- ","---- "]
["Isooctyl alcohol ","26952-21-6 ","50 ppm ","75 ppm ","---- ","X  "]
["Isophorone ","78-59-1 ","4 ppm ","---- ","5 ppm ","---- "]
["Isophorone diisocyanate ","4098-71-9 ","0.005 ppm ","0.02 ppm ","---- ","X  "]
["Isopropoxyethanol ","109-59-1 ","25 ppm ","38 ppm ","---- ","---- "]
["Isopropyl acetate ","108-21-4 ","250 ppm ","310 ppm ","---- ","---- "]
["Isopropyl alcohol ","67-63-0 ","400 ppm ","500 ppm ","---- ","---- "]
["Isopropylamine ","75-31-0 ","5 ppm ","10 ppm ","---- ","---- "]
["N-Isopropylaniline ","768-52-5 ","2 ppm ","4 ppm ","---- ","X  "]
["Isopropyl ether ","108-20-3 ","250 ppm ","313 ppm ","---- ","---- "]
["Isopropyl glycidyl ether (IGE) ","4016-14-2 ","50 ppm ","75 ppm ","----- ","---- "]
["Kaolin ","---- ","---- ","---- ","---- ","---- "]
["     Total particulate ","---- ","10 mg/m3 ","20 mg/m3 ","---- ","---- "]
["     Respirable fraction ","---- ","5 mg/m3 ","10 mg/m3 ","---- ","---- "]
["Ketene ","463-51-4 ","0.5 mg/m3 ","1.5 mg/m3 ","---- ","---- "]
["Lannate","16752-77-5 ","2.5 mg/m3 ","5 mg/m3 ","---- ","---- "]
["     (Methomyl) "]
["Lead, inorganic (as Pb)","7439-92-1 ","0.05 mg/m3 ","---- ","---- ","---- "]
["     (see WAC 296-62-07521"]
["     and 296-155-176) "]
["Lead arsenate (as Pb)","3687-31-8 ","0.05 mg/m3 ","---- ","---- ","---- "]
["     (see WAC 296-62-07521,"]
["     296-155-176, and chapter"]
["     296-848 WAC) "]
["Lead chromate (as Pb)","7758-97-6 ","0.05 mg/m3 ","---- ","---- ","---- "]
["     (see WAC 296-62-08003,"]
["     296-62-07521, and"]
["     296-155-176) "]
["Limestone ","1317-65-3 ","---- ","---- ","---- ","---- "]
["     Total particulate ","---- ","10 mg/m3 ","20 mg/m3 ","---- ","---- "]
["     Respirable fraction ","---- ","5 mg/m3 ","10 mg/m3 ","---- ","---- "]
["Lindane ","58-89-9 ","0.5 mg/m3 ","1.5 mg/m3 ","---- ","X  "]
["Lithium hydride ","7580-67-8 ","0.025 mg/m3 ","0.075 mg/m3 ","---- ","---- "]
["L.P.G.","68476-85-7 ","1,000 ppm ","1,250 ppm ","---- ","---- "]
["     (liquified petroleum gas) "]
["Magnesite ","546-93-0 ","---- ","---- ","---- ","---- "]
["     Total particulate ","---- ","10 mg/m3 ","20 mg/m3 ","---- ","---- "]
["     Respirable fraction ","---- ","5 mg/m3 ","10 mg/m3 ","---- ","---- "]
["Magnesium oxide fume ","1309-48-4 ","---- ","---- ","---- ","---- "]
["     Total particulate ","---- ","10 mg/m3 ","20 mg/m3 ","---- ","---- "]
["Malathion ","121-75-5 ","---- ","---- ","---- ","---- "]
["     Total particulate ","---- ","10 mg/m3 ","20 mg/m3 ","---- ","X  "]
["Maleic anhydride ","108-31-6 ","0.25 ppm ","0.75 ppm ","---- ","---- "]
["Manganese and compounds (as Mn) ","7439-96-5 ","---- ","---- ","5 mg/m3 ","---- "]
["Manganese cyclopentadienyl","12079-65-1 ","0.1 mg/m3 ","0.3 mg/m3 ","---- ","X  "]
["     tricarbonyl (as Mn) "]
["Manganese tetroxide and","7439-96-5 ","1 mg/m3 ","3 mg/m3 ","---- ","---- "]
["     fume (as Mn) "]
["Marble ","1317-65-3 ","---- ","---- ","---- ","---- "]
["     Total particulate ","---- ","10 mg/m3 ","20 mg/m3 ","---- ","---- "]
["     Respirable fraction ","---- ","5 mg/m3 ","10 mg/m3 ","---- ","---- "]
["MBOCA","101-14-4 ","---- ","---- ","---- ","X "]
["     (4, 4'-Methylene bis"]
["     (2-chloro-aniline))"]
["     (see WAC 296-62-073) "]
["MDA","101-77-9 ","0.01 ppm ","0.1 ppm ","---- ","X "]
["     (4, 4-Methylene dianiline)"]
["     (see WAC 296-62-076"]
["     and 296-155-173) "]
["MDI","101-68-8 ","---- ","---- ","0.02 ppm ","---- "]
["     (Methylene bisphenyl"]
["     isocyanate)"]
["     (Diphenylmethane"]
["     diisocyanate) "]
["MEK","78-93-3 ","200 ppm ","300 ppm ","---- ","---- "]
["     (Methyl ethyl ketone)"]
["     (2-Butanone) "]
["MEKP","1338-23-4 ","---- ","---- ","0.2 ppm ","---- "]
["     (Methyl ethyl ketone peroxide) "]
["Mercury (as Hg) ","7439-97-6 ","---- ","---- ","---- ","---- "]
["     Aryl and inorganic ","---- ","0.1 mg/m3 ","0.3 mg/m3 ","---- ","X  "]
["     Organo-alkyl compounds ","---- ","0.01 mg/m3 ","0.03 mg/m3 ","---- ","X  "]
["     Vapor ","---- ","0.05 mg/m3 ","0.15 mg/m3 ","---- ","X "]
["Mesityl oxide ","141-79-7 ","15 ppm ","25 ppm ","---- ","---- "]
["Methacrylic acid ","79-41-4 ","20 ppm ","30 ppm ","---- ","X  "]
["Methane ","---- ","Simple asphyxiant ","---- ","---- ","---- "]
["Methanethiol","74-93-1 ","0.5 ppm ","1.5 ppm ","---- ","---- "]
["     (Methyl mercaptan) "]
["Methanol","67-56-1 ","200 ppm ","250 ppm ","---- ","X "]
["     (Methyl alcohol) "]
["Methomyl (lannate) ","16752-77-5 ","2.5 mg/m3 ","5 mg/m3 ","---- ","---- "]
["Methoxychlor ","72-43-5 ","---- ","---- ","---- ","---- "]
["     Total particulate ","---- ","10 mg/m3 ","20 mg/m3 ","---- ","---- "]
["2-Methoxyethanol","109-86-4 ","5 ppm ","10 ppm ","---- ","X  "]
["     (Methyl cellosolve) "]
["2-Methoxyethyl acetate","110-49-6 ","5 ppm ","10 ppm ","---- ","X "]
["     (Methyl cellosolve acetate) "]
["4-Methoxyphenol ","150-76-5 ","5 mg/m3 ","10 mg/m3 ","---- ","---- "]
["Methyl acetate ","79-20-9 ","200 ppm ","250 ppm ","---- ","---- "]
["Methyl acetylene (propyne) ","74-99-7 ","1,000 ppm ","1,250 ppm ","---- ","---- "]
["Methyl acetylene-propadiene","---- ","1,000 ppm ","1,250 ppm ","---- ","---- "]
["     mixture (MAPP) "]
["Methyl acrylate ","96-33-3 ","10 ppm ","20 ppm ","---- ","X  "]
["Methylacrylonitrile ","126-98-7 ","1 ppm ","3 ppm ","---- ","X  "]
["Methylal (Dimethoxy-methane) ","109-87-5 ","1,000 ppm ","1,250 ppm ","---- ","---- "]
["Methyl alcohol (methanol) ","67-56-1 ","200 ppm ","250 ppm ","---- ","X  "]
["Methylamine ","74-89-5 ","10 ppm ","20 ppm ","---- ","---- "]
["Methyl amyl alcohol","108-11-2 ","25 ppm ","40 ppm ","---- ","X "]
["     (Methyl isobutyl carbinol) "]
["Methyl n-amyl ketone","110-43-0 ","50 ppm ","75 ppm ","---- ","---- "]
["     (2-Heptanone) "]
["N-Methyl aniline","100-61-8 ","0.5 ppm ","1.5 ppm ","---- ","X "]
["     (Monomethyl aniline) "]
["Methyl bromide ","74-83-9 ","5 ppm ","10 ppm ","---- ","X  "]
["Methyl-n-butyl ketone","591-78-6 ","5 ppm ","10 ppm ","---- ","---- "]
["     (2-Hexanone) "]
["Methyl cellosolve","109-86-4 ","5 ppm ","10 ppm ","---- ","X  "]
["     (2-Methoxyethanol) "]
["Methyl cellosolve acetate","110-49-6 ","5 ppm ","10 ppm ","---- ","X  "]
["     (2-Methoxyethyl acetate) "]
["Methyl chloride ","74-87-3 ","50 ppm ","100 ppm ","---- ","---- "]
["Methyl chloroform","71-55-6 ","350 ppm ","450 ppm ","---- ","---- "]
["     (1, 1, 1-trichlorethane) "]
["Methyl chloromethyl ether","107-30-2 ","---- ","---- ","---- ","---- "]
["     (chloromethyl methyl"]
["     ether)"]
["     (see WAC 296-62-073) "]
["Methyl 2-cyanoacrylate ","137-05-3 ","2 ppm ","4 ppm ","---- ","---- "]
["Methylcyclohexane ","108-87-2 ","400 ppm ","500 ppm ","---- ","---- "]
["Methylcyclohexanol ","25639-42-3 ","50 ppm ","75 ppm ","---- ","---- "]
["Methylcyclohexanone ","583-60-8 ","50 ppm ","75 ppm ","---- ","X  "]
["Methylcyclopentadienyl","12108-13-3 ","0.2 mg/m3 ","0.6 mg/m3 ","---- ","X  "]
["     manganese tricarbonyl (as           Mn) "]
["Methyl demeton ","8022-00-2 ","0.5 mg/m3 ","1.5 mg/m3 ","---- ","X  "]
["Methylene bisphenyl isocyanate","101-68-8 ","---- ","---- ","0.02 ppm ","---- "]
["     (MDI)"]
["     (Diphenylmethane                     diisocyanate) "]
["4, 4'-Methylene bis","101-14-4 ","---- ","---- ","---- ","X  "]
["     (2-chloro-aniline) (MBOCA)"]
["     (see WAC 296-62-073) "]
["Methylene bis","5124-30-1 ","---- ","---- ","0.01 ppm ","---- "]
["     (4-cyclohexylisocyanate) "]
["Methylene chloride","75-09-2 ","25 ppm ","125 ppm ","---- ","---- "]
["     (Dichloromethane)"]
["     (see chapter 296-859 WAC) "]
["4, 4-Methylene dianiline (MDA)","101-77-9 ","0.01 ppm ","0.1 ppm ","---- ","X  "]
["     (see WAC 296-62-076"]
["     and 296-155-173) "]
["Methyl ethyl ketone (MEK)","78-93-3 ","200 ppm ","300 ppm ","---- ","---- "]
["     (2-Butanone) "]
["Methyl ethyl ketone peroxide","1338-23-4 ","---- ","---- ","0.2 ppm ","---- "]
["     (MEKP) "]
["Methyl formate ","107-31-3 ","100 ppm ","150 ppm ","---- ","---- "]
["5-Methyl-3-heptanone","541-85-5 ","25 ppm ","38 ppm ","---- ","---- "]
["     (Ethyl amyl ketone) "]
["Methyl hydrazine","60-34-4 ","---- ","---- ","0.2 ppm ","X  "]
["     (Monomethyl hydrazine) "]
["Methyl iodide ","74-88-4 ","2 ppm ","4 ppm ","---- ","X  "]
["Methyl isoamyl ketone ","110-12-3 ","50 ppm ","75 ppm ","---- ","---- "]
["Methyl isobutyl carbinol","108-11-2 ","25 ppm ","40 ppm ","---- ","X  "]
["     (Methyl amyl alcohol) "]
["Methyl isobutyl ketone","108-10-1 ","50 ppm ","75 ppm ","---- ","---- "]
["     (Hexone) "]
["Methyl isocyanate ","624-83-9 ","0.02 ppm ","0.06 ppm ","---- ","X  "]
["Methyl isopropyl ketone ","563-80-4 ","200 ppm ","250 ppm ","---- ","---- "]
["Methyl mercaptan (Methanethiol) ","74-93-1 ","0.5 ppm ","1.5 ppm ","---- ","---- "]
["Methyl methacrylate ","80-62-6 ","100 ppm ","150 ppm ","---- ","---- "]
["Methyl parathion ","298-00-0 ","0.2 mg/m3 ","0.6 mg/m3 ","---- ","X  "]
["Methyl propyl ketone","107-87-9 ","200 ppm ","250 ppm ","---- ","---- "]
["     (2-Pentanone) "]
["Methyl silicate ","684-84-5 ","1 ppm ","3 ppm ","---- ","---- "]
["alpha-Methyl styrene ","98-83-9 ","50 ppm ","100 ppm ","---- ","---- "]
["Mevinphos (Phosdrin) ","7786-34-7 ","0.01 ppm ","0.03 ppm ","---- ","X "]
["Metribuzin ","21087-64-9 ","5 mg/m3 ","10 mg/m3 ","---- ","---- "]
["Mica (Silicates)","12001-26-2 ","3 mg/m3 ","6 mg/m3 ","---- ","---- "]
["     Respirable fraction "]
["Molybdenum (as Mo) ","7439-98-7 ","---- ","---- ","---- ","---- "]
["     Soluble compounds ","---- ","5 mg/m3 ","10 mg/m3 ","---- ","---- "]
["     Insoluble compounds ","---- ","10 mg/m3 ","20 mg/m3 ","---- ","---- "]
["Monochlorobenzene","108-90-7 ","75 ppm ","113 ppm ","---- ","---- "]
["     (Chlorobenzene) "]
["Monocrotophos (Azodrin) ","6923-22-4 ","0.25 mg/m3 ","0.75 mg/m3 ","---- ","---- "]
["Monomethyl aniline","100-61-8 ","0.5 ppm ","1.5 ppm ","---- ","X  "]
["     (N-Methyl aniline) "]
["Monomethyl hydrazine ","---- ","---- ","---- ","0.2 ppm ","---- "]
["Morpholine ","110-91-8 ","20 ppm ","30 ppm ","---- ","X  "]
["Naled (Dibrom) ","300-76-5 ","3 mg/m3 ","6 mg/m3 ","---- ","X  "]
["Naphtha ","8030-30-6 ","100 ppm ","150 ppm ","---- ","X  "]
["Naphthalene ","91-20-3 ","10 ppm ","15 ppm ","---- ","---- "]
["alpha-Naphthylamine","134-32-7 ","---- ","---- ","---- ","---- "]
["     (see WAC 296-62-073) "]
["beta-Naphthylamine","91-59-8 ","---- ","---- ","---- ","---- "]
["     (see WAC 296-62-073) "]
["Neon ","7440-01-9 ","Simple asphyxiant ","---- ","---- ","---- "]
["Nickel carbonyl (as Ni) ","13463-39-3 ","0.001 ppm ","0.003 ppm ","---- ","---- "]
["Nickel (as Ni) ","7440-02-0 ","---- ","---- ","---- ","---- "]
["     Metal and insoluble","---- ","1 mg/m3 ","3 mg/m3 ","---- ","---- "]
["     compounds "]
["     Soluble compounds ","---- ","0.1 mg/m3 ","0.3 mg/m3 ","---- ","---- "]
["Nicotine ","54-11-5 ","0.5 mg/m3 ","1.5 mg/m3 ","---- ","X  "]
["Nitrapyrin","1929-82-4 ","---- ","---- ","---- ","---- "]
["     (2-Chloro-6"]
["     trichloromethyl pyridine) "]
["     Total particulate ","---- ","10 mg/m3 ","20 mg/m3 ","---- ","---- "]
["     Respirable fraction ","---- ","5 mg/m3 ","10 mg/m3 ","---- ","---- "]
["Nitric acid ","7697-37-2 ","2 ppm ","4 ppm ","---- ","---- "]
["Nitric oxide ","10102-43-9 ","25 ppm ","38 ppm ","---- ","---- "]
["p-Nitroaniline ","100-01-6 ","3 mg/m3 ","6 mg/m3 ","---- ","X  "]
["Nitrobenzene ","98-95-3 ","1 ppm ","3 ppm ","---- ","X  "]
["4-Nitrobiphenyl","92-93-3 ","---- ","---- ","---- ","---- "]
["     (see WAC 296-62-073) "]
["p-Nitrochlorobenzene ","100-00-5 ","0.5 mg/m3 ","1.5 mg/m3 ","---- ","X  "]
["4-Nitrodiphenyl","---- ","---- ","---- ","---- ","---- "]
["     (see WAC 296-62-073) "]
["Nitroethane ","79-24-3 ","100 ppm ","150 ppm ","---- ","---- "]
["Nitrogen ","7727-37-9 ","Simple asphyxiant ","---- ","---- ","---- "]
["Nitrogen dioxide ","10102-44-0 ","---- ","1 ppm ","---- ","---- "]
["Nitrogen oxide","10024-97-2 ","50 ppm ","75 ppm ","---- ","---- "]
["     (Nitrous oxide) "]
["Nitrogen trifluoride ","7783-54-2 ","10 ppm ","20 ppm ","---- ","---- "]
["Nitroglycerin ","55-63-0 ","---- ","0.1 mg/m3 ","---- ","X  "]
["Nitromethane ","75-52-5 ","100 ppm ","150 ppm ","---- ","---- "]
["1-Nitropropane ","108-03-2 ","25 ppm ","38 ppm ","---- ","---- "]
["2-Nitropropane ","79-46-9 ","10 ppm ","20 ppm ","---- ","---- "]
["N-Nitrosodimethylamine","62-75-9 ","---- ","---- ","---- ","---- "]
["     (see WAC 296-62-073) "]
["Nitrotoluene ","---- ","---- ","---- ","---- ","---- "]
["     o-isomer ","88-72-2 ","2 ppm ","4 ppm ","---- ","X  "]
["     m-isomer ","98-08-2 ","2 ppm ","4 ppm ","---- ","X  "]
["     p-isomer ","99-99-0 ","2 ppm ","4 ppm ","---- ","X  "]
["Nitrotrichloromethane","76-06-2 ","0.1 ppm ","0.3 ppm ","---- ","---- "]
["     (Chloropicrin) "]
["Nitrous oxide","10024-97-2 ","50 ppm ","75 ppm ","---- ","---- "]
["     (Nitrogen oxide) "]
["Nonane ","111-84-2 ","200 ppm ","250 ppm ","---- ","---- "]
["Nuisance dusts (see Particulates not otherwise regulated) ","---- ","---- ","---- ","---- ","---- "]
["Octachloronaphthalene ","2234-13-1 ","0.1 mg/m3 ","0.3 mg/m3 ","---- ","X  "]
["Octane ","111-65-9 ","300 ppm ","375 ppm ","---- ","---- "]
["Oil mist mineral (particulate) ","8012-95-1 ","5 mg/m3 ","10 mg/m3 ","---- ","---- "]
["Osmium tetroxide (as Os) ","20816-12-0 ","0.0002 ppm ","0.0006 ppm ","---- ","---- "]
["Oxalic acid ","144-62-7 ","1 mg/m3 ","2 mg/m3 ","---- ","---- "]
["Oxygen","---- ","---- ","---- ","---- ","---- "]
["     See requirements in other"]
["     chapters such as:"]
["     Chapter 296-809 WAC,"]
["     Confined spaces; chapter"]
["     296-843 WAC, Hazardous"]
["     waste operations; chapter"]
["     296-824 WAC, Emergency"]
["     response; WAC 296-62-100,"]
["     Oxygen deficient"]
["     atmospheres "]
["Oxygen difluoride ","7783-41-7 ","---- ","---- ","0.05 ppm ","---- "]
["Ozone ","10028-15-6 ","0.1 ppm ","0.3 ppm ","---- ","---- "]
["Paper fiber","9004-34-6 ","---- ","---- ","---- ","---- "]
["     (Cellulose) "]
["     Total particulate ","---- ","10 mg/m3 ","20 mg/m3 ","---- ","---- "]
["     Respirable fraction ","---- ","5 mg/m3 ","10 mg/m3 ","---- ","---- "]
["Paraffin wax fume ","8002-74-2 ","2 mg/m3 ","4 mg/m3 ","---- ","---- "]
["Paraquat ","---- ","---- ","---- ","---- ","---- "]
["     Respirable fraction ","4685-14-7 ","0.1 mg/m3 ","0.3 mg/m3 ","---- ","X  "]
["  ","1910-42-5 ","  ","  ","  ","  "]
["  ","2074-50-2 ","  ","  ","  ","  "]
["Parathion ","56-38-2 ","0.1 mg/m3 ","0.3 mg/m3 ","---- ","X  "]
["Particulate polycyclic","  ","  ","  ","---- ","---- "]
["     aromatic hydrocarbons"]
["     (see coal tar pitch volatiles) "]
["Particulates not otherwise","---- ","---- ","---- ","---- ","---- "]
["     regulated "]
["     Total particulate ","---- ","10 mg/m3 ","20 mg/m3 ","---- ","---- "]
["     Respirable fraction ","---- ","5 mg/m3 ","10 mg/m3 ","---- ","---- "]
["Pentaborane ","19624-22-7 ","0.005 ppm ","0.015 ppm ","---- ","---- "]
["Pentachloronaphthalene ","1321-64-8 ","0.5 mg/m3 ","1.5 mg/m3 ","---- ","X  "]
["Pentachlorophenol ","87-86-5 ","0.5 mg/m3 ","1.5 mg/m3 ","---- ","X  "]
["Pentaerythritol ","115-77-5 ","---- ","---- ","---- ","---- "]
["     Total particulate ","---- ","10 mg/m3 ","20 mg/m3 ","---- ","---- "]
["     Respirable fraction ","---- ","5 mg/m3 ","10 mg/m3 ","---- ","---- "]
["Pentane ","109-66-0 ","600 ppm ","750 ppm ","---- ","---- "]
["2-Pentanone","107-87-9 ","200 ppm ","250 ppm ","---- ","---- "]
["     (methyl propyl ketone) "]
["Perchloroethylene","127-18-4 ","25 ppm ","38 ppm ","---- ","---- "]
["     (tetrachloroethylene) "]
["Perchloromethyl mercaptan ","594-42-3 ","0.1 ppm ","0.3 ppm ","---- ","---- "]
["Perchloryl fluoride ","7616-94-6 ","3 ppm ","6 ppm ","---- ","---- "]
["Perlite ","---- ","---- ","---- ","---- ","---- "]
["     Total particulate ","---- ","10 mg/m3 ","20 mg/m3 ","---- ","---- "]
["     Respirable fraction ","---- ","5 mg/m3 ","10 mg/m3 ","---- ","---- "]
["Petroleum distillates","---- ","100 ppm ","150 ppm ","---- ","---- "]
["     (Naptha, rubber solvent) "]
["Phenacyl chloride","532-21-4 ","0.05 ppm ","0.15 ppm ","---- ","---- "]
["     (a-Chloroacetophenone) "]
["Phenol ","108-95-2 ","5 ppm ","10 ppm ","---- ","X  "]
["Phenothiazine ","92-84-2 ","5 mg/m3 ","10 mg/m3 ","---- ","X  "]
["p-Phenylene diamine ","106-50-3 ","0.1 mg/m3 ","0.3 mg/m3 ","---- ","X  "]
["Phenyl ether (vapor) ","101-84-8 ","1 ppm ","3 ppm ","---- ","---- "]
["Phenyl ether-diphenyl","---- ","1 ppm ","3 ppm ","---- ","---- "]
["     mixture (vapor) "]
["Phenylethylene (Styrene) ","100-42-5 ","50 ppm ","100 ppm ","---- ","---- "]
["Phenyl glycidyl ether (PGE) ","122-60-1 ","1 ppm ","3 ppm ","---- ","---- "]
["Phenylhydrazine ","100-63-0 ","5 ppm ","10 ppm ","---- ","X  "]
["Phenyl mercaptan ","108-98-5 ","0.5 ppm ","1.5 ppm ","---- ","---- "]
["Phenylphosphine ","638-21-1 ","---- ","---- ","0.05 ppm ","---- "]
["Phorate ","298-02-2 ","0.05 mg/m3 ","0.2 mg/m3 ","---- ","X  "]
["Phosdrin (Mevinphos) ","7786-34-7 ","0.01 ppm ","0.03 ppm ","---- ","X  "]
["Phosgene (carbonyl chloride) ","75-44-5 ","0.1 ppm ","0.3 ppm ","---- ","---- "]
["Phosphine ","7803-51-2 ","0.3 ppm ","1 ppm ","---- ","---- "]
["Phosphoric acid ","7664-38-2 ","1 mg/m3 ","3 mg/m3 ","---- ","---- "]
["Phosphorus (yellow) ","7723-14-0 ","0.1 mg/m3 ","0.3 mg/m3 ","---- ","---- "]
["Phosphorous oxychloride ","10025-87-3 ","0.1 ppm ","0.3 ppm ","---- ","---- "]
["Phosphorus pentachloride ","10026-13-8 ","0.1 ppm ","0.3 ppm ","---- ","---- "]
["Phosphorus pentasulfide ","1314-80-3 ","1 mg/m3 ","3 mg/m3 ","---- ","---- "]
["Phosphorus trichloride ","12-2-19 ","0.2 ppm ","0.5 ppm ","---- ","---- "]
["Phthalic anhydride ","85-44-9 ","1 ppm ","3 ppm ","---- ","---- "]
["m-Phthalodinitrile ","626-17-5 ","5 mg/m3 ","10 mg/m3 ","---- ","---- "]
["Picloram ","1918-02-1 ","---- ","---- ","---- ","---- "]
["     Total particulate ","---- ","10 mg/m3 ","20 mg/m3 ","---- ","---- "]
["     Respirable fraction ","---- ","5 mg/m3 ","10 mg/m3 ","---- ","---- "]
["Picric acid (2, 4, 6-","88-89-1 ","0.1 mg/m3 ","0.3 mg/m3 ","---- ","X  "]
["     Trinitrophenol) "]
["Pindone","83-26-1 ","0.1 mg/m3 ","0.3 mg/m3 ","---- ","---- "]
["     (2-Pivalyl-1, 3-indandione,"]
["     Pival) "]
["Piperazine dihydrochloride ","142-64-3 ","5 mg/m3 ","10 mg/m3 ","---- ","---- "]
["Pival (Pindone) ","83-26-1 ","0.1 mg/m3 ","0.3 mg/m3 ","---- ","---- "]
["Plaster of Paris ","26499-65-0 ","---- ","---- ","---- ","---- "]
["     Total particulate ","---- ","10 mg/m3 ","20 mg/m3 ","---- ","---- "]
["     Respirable fraction ","---- ","5 mg/m3 ","10 mg/m3 ","---- ","---- "]
["Platinum (as Pt) ","7440-06-4 ","---- ","---- ","---- ","---- "]
["     Metal ","---- ","1 mg/m3 ","3 mg/m3 ","---- ","---- "]
["     Soluble salts ","---- ","0.002 mg/m3 ","0.006 mg/m3 ","---- ","---- "]
["Polychlorobiphenyls","---- ","---- ","---- ","---- ","---- "]
["     (Chlorodiphenyls) "]
["     42% Chlorine (PCB) ","53469-21-9 ","1 mg/m3 ","3 mg/m3 ","---- ","X "]
["     54% Chlorine (PCB) ","11097-69-1 ","0.5 mg/m3 ","1.5 mg/m3 ","---- ","X "]
["Portland cement ","65997-15-1 ","---- ","---- ","---- ","---- "]
["     Total particulate ","---- ","10 mg/m3 ","20 mg/m3 ","---- ","---- "]
["     Respirable fraction ","---- ","5 mg/m3 ","10 mg/m3 ","---- ","---- "]
["Potassium hydroxide ","1310-58-3 ","---- ","---- ","2 mg/m3 ","---- "]
["Propane ","74-98-6 ","1,000 ppm ","1,250 ppm ","---- ","---- "]
["Propargyl alcohol ","107-19-7 ","1 ppm ","3 ppm ","---- ","X  "]
["beta-Propiolactone","57-57-8 ","---- ","---- ","---- ","---- "]
["     (see WAC 296-62-073) "]
["Propionic acid ","79-09-4 ","10 ppm ","20 ppm ","---- ","---- "]
["Propoxur (Baygon) ","114-26-1 ","0.5 mg/m3 ","1.5 mg/m3 ","---- ","---- "]
["n-Propyl acetate ","109-60-4 ","200 ppm ","250 ppm ","---- ","---- "]
["n-Propyl alcohol ","71-23-8 ","200 ppm ","250 ppm ","---- ","X  "]
["n-Propyl nitrate ","627-13-4 ","25 ppm ","40 ppm ","---- ","---- "]
["Propylene ","---- ","Simple asphyxiant ","---- ","---- ","---- "]
["Propylene dichloride","78-87-5 ","75 ppm ","110 ppm ","---- ","---- "]
["     (1, 2-Dichloropropane) "]
["Propylene glycol dinitrate ","6423-43-4 ","0.05 ppm ","0.15 ppm ","---- ","X  "]
["Propylene glycol","107-98-2 ","100 ppm ","150 ppm ","---- ","---- "]
["     monomethyl ether "]
["Propylene imine ","75-55-8 ","2 ppm ","4 ppm ","---- ","X  "]
["Propylene oxide (1,2-","75-56-9 ","20 ppm ","30 ppm ","---- ","---- "]
["     Epoxypropane) "]
["Propyne (Methyl acetylene) ","74-99-7 ","1,000 ppm ","1,250 ppm ","---- ","---- "]
["Pyrethrum ","8003-34-7 ","5 mg/m3 ","10 mg/m3 ","---- ","---- "]
["Pyridine ","110-86-1 ","5 ppm ","10 ppm ","---- ","---- "]
["Pyrocatachol","120-80-9 ","5 ppm ","10 ppm ","---- ","X "]
["     (Catechol) "]
["Quinone (p-Benzoquinone) ","106-51-4 ","0.1 ppm ","0.3 ppm ","---- ","---- "]
["RDX (Cyclonite) ","---- ","1.5 mg/m3 ","3 mg/m3 ","---- ","X  "]
["Resorcinol ","108-46-3 ","10 ppm ","20 ppm ","---- ","---- "]
["Rhodium (as Rh) ","7440-16-6 ","---- ","---- ","---- ","---- "]
["     Insoluble compounds,","---- ","0.1 mg/m3 ","0.3 mg/m3 ","---- ","---- "]
["     metal fumes and dusts "]
["     Soluble compounds, salts ","---- ","0.001 mg/m3 ","0.003 mg/m3 ","---- ","---- "]
["Ronnel ","299-84-3 ","10 mg/m3 ","20 mg/m3 ","---- ","---- "]
["Rosin core solder, pyrolysis","8050-09-7 ","0.1 mg/m3 ","0.3 mg/m3 ","---- ","---- "]
["     products (as formaldehyde) "]
["Rotenone ","83-79-4 ","5 mg/m3 ","10 mg/m3 ","---- ","---- "]
["Rouge ","---- ","---- ","---- ","---- ","---- "]
["     Total particulate ","---- ","10 mg/m3 ","20 mg/m3 ","---- ","---- "]
["     Respirable fraction ","---- ","5 mg/m3 ","10 mg/m3 ","---- ","---- "]
["Rubber solvent (naphtha) ","8030-30-6 ","100 ppm ","150 ppm ","---- ","---- "]
["Selenium compounds (as Se) ","7782-49-2 ","0.2 mg/m3 ","0.6 mg/m3 ","---- ","---- "]
["Selenium hexafluoride (as Se) ","7783-79-1 ","0.05 ppm ","0.15 ppm ","---- ","---- "]
["Sesone (Crag herbicide) ","136-78-7 ","---- ","---- ","---- ","---- "]
["     Total particulate ","---- ","10 mg/m3 ","20 mg/m3 ","---- ","---- "]
["     Respirable fraction ","---- ","5 mg/m3 ","10 mg/m3 ","---- ","---- "]
["Sevin","63-25-2 ","5 mg/m3 ","10 mg/m3 ","---- ","---- "]
["     (Carbaryl) "]
["Silane (see Silicon tetrahydride) ","7803-62-5 ","5 ppm ","10 ppm ","---- ","---- "]
["Silica, amorphous, precipitated","112926-00-8 ","6 mg/m3 ","12 mg/m3 ","---- ","---- "]
["     and gel "]
["Silica, amorphous, diatomaceous","61790-53-2 ","---- ","---- ","---- ","---- "]
["     earth, containing less than"]
["     1% crystalline silica "]
["     Total particulate ","---- ","6 mg/m3 ","12 mg/m3 ","---- ","---- "]
["     Respirable fraction ","---- ","3 mg/m3 ","6 mg/m3 ","---- ","---- "]
["Silica, crystalline cristobalite ","---- ","---- ","---- ","---- ","---- "]
["     Respirable fraction ","14464-46-1 ","0.05 mg/m3 ","0.15 mg/m3 ","---- ","---- "]
["Silica, crystalline quartz ","---- ","---- ","---- ","---- ","---- "]
["     Respirable fraction ","14808-60-7 ","0.1 mg/m3 ","0.3 mg/m3 ","---- ","---- "]
["Silica, crystalline tripoli","---- ","---- ","---- ","---- ","---- "]
["     (as quartz) "]
["     Respirable fraction ","1317-95-9 ","0.1 mg/m3 ","0.3 mg/m3 ","---- ","---- "]
["Silica, crystalline tridymite ","---- ","---- ","---- ","---- ","---- "]
["     Respirable fraction ","15468-32-3 ","0.05 mg/m3 ","0.15 mg/m3 ","---- ","---- "]
["Silica, fused ","---- ","---- ","---- ","---- ","---- "]
["     Respirable fraction ","60676-86-0 ","0.1 mg/m3 ","0.3 mg/m3 ","---- ","---- "]
["Silicates (less than 1% crystalline silica) ","---- ","---- ","---- ","---- ","---- "]
["     Mica ","---- ","---- ","---- ","---- ","---- "]
["          Respirable fraction ","12001-26-2 ","3 mg/m3 ","6 mg/m3 ","---- ","---- "]
["     Soapstone ","---- ","---- ","---- ","---- ","---- "]
["          Total particulate ","---- ","6 mg/m3 ","12 mg/m3 ","---- ","---- "]
["          Respirable fraction ","---- ","3 mg/m3 ","6 mg/m3 ","---- ","---- "]
["     Talc (containing asbestos)","---- ","0.1 f/cc ","1.0 f/cc (30 minutes) ","---- ","---- "]
["          (as asbestos)"]
["          (see WAC"]
["          296-62-07705 and"]
["          chapter 296-65 WAC) "]
["     Talc (containing no","---- ","---- ","---- ","---- ","---- "]
["          asbestos) "]
["          Respirable fraction ","14807-96-6 ","2 mg/m3 ","4 mg/m3 ","---- ","---- "]
["     Tremolite","---- ","0.1 f/cc ","1.0 f/cc (30 minutes) ","---- ","---- "]
["          (asbestiform)"]
["          (as asbestos)"]
["          (see WAC"]
["          296-62-07705"]
["          and chapter 296-65 WAC) "]
["Silicon ","7440-21-3 ","---- ","---- ","---- ","---- "]
["     Total particulate ","---- ","10 mg/m3 ","20 mg/m3 ","---- ","---- "]
["     Respirable fraction ","---- ","5 mg/m3 ","10 mg/m3 ","---- ","---- "]
["Silicon carbide ","409-21-2 ","---- ","---- ","---- ","---- "]
["     Total particulate ","---- ","10 mg/m3 ","20 mg/m3 ","---- ","---- "]
["     Respirable fraction ","---- ","5 mg/m3 ","10 mg/m3 ","---- ","---- "]
["Silicon tetrahydride (Silane) ","7803-62-5 ","5 ppm ","10 ppm ","---- ","---- "]
["Silver, metal dust and soluble","7440-22-4 ","0.01 mg/m3 ","0.03 mg/m3 ","---- ","---- "]
["     compounds (as Ag) "]
["Soapstone ","---- ","---- ","---- ","---- ","---- "]
["     Total particulate ","---- ","6 mg/m3 ","12 mg/m3 ","---- ","---- "]
["     Respirable fraction ","---- ","3 mg/m3 ","6 mg/m3 ","---- ","---- "]
["Sodium azide (as HN3 or NaN3) ","26628-22-8 ","---- ","---- ","0.1 ppm ","X "]
["Sodium bisulfite ","7631-90-5 ","5 mg/m3 ","10 mg/m3 ","---- ","---- "]
["Sodium-2,","136-78-7 ","---- ","---- ","---- ","---- "]
["     4-dichloro-"]
["     phenoxyethyl"]
["     sulfate"]
["     (Crag herbicide) "]
["     Total particulate ","---- ","10 mg/m3 ","20 mg/m3 ","---- ","---- "]
["     Respirable fraction ","---- ","5 mg/m3 ","10 mg/m3 ","---- ","---- "]
["Sodium fluoroacetate ","62-74-8 ","0.05 mg/m3 ","0.15 mg/m3 ","---- ","X  "]
["Sodium hydroxide ","1310-73-2 ","---- ","---- ","2 mg/m3 ","---- "]
["Sodium metabisulfite ","7681-57-4 ","5 mg/m3 ","10 mg/m3 ","---- ","---- "]
["Starch ","9005-25-8 ","---- ","---- ","---- ","---- "]
["     Total particulate ","---- ","10 mg/m3 ","20 mg/m3 ","---- ","---- "]
["     Respirable fraction ","---- ","5 mg/m3 ","10 mg/m3 ","---- ","---- "]
["Stibine ","7803-52-3 ","0.1 ppm ","0.3 ppm ","---- ","---- "]
["Stoddard solvent ","8052-41-3 ","100 ppm ","150 ppm ","---- ","---- "]
["Strychnine ","57-24-9 ","0.15 mg/m3 ","0.45 mg/m3 ","---- ","---- "]
["Styrene (Phenylethylene,","100-42-5 ","50 ppm ","100 ppm ","---- ","---- "]
["     Vinyl benzene) "]
["Subtilisins ","9014-01-1 ","---- ","0.00006 mg/m3 ","---- ","---- "]
["Sucrose ","57-50-1 ","---- ","---- ","---- ","---- "]
["     Total particulate ","---- ","10 mg/m3 ","20 mg/m3 ","---- ","---- "]
["     Respirable fraction ","---- ","5 mg/m3 ","10 mg/m3 ","---- ","---- "]
["Sulfotep (TEDP) ","3689-24-5 ","0.2 mg/m3 ","0.6 mg/m3 ","---- ","X  "]
["Sulfur dioxide ","7446-09-5 ","2 ppm ","5 ppm ","---- ","---- "]
["Sulfur hexafluoride ","2551-62-4 ","1,000 ppm ","1,250 ppm ","---- ","---- "]
["Sulfuric acid ","7664-93-9 ","1 mg/m3 ","3 mg/m3 ","---- ","---- "]
["Sulfur monochloride ","10025-67-9 ","---- ","---- ","1 ppm ","---- "]
["Sulfur pentafluoride ","5714-22-1 ","---- ","---- ","0.01 ppm ","---- "]
["Sulfur tetrafluoride ","7783-60-0 ","---- ","---- ","0.1 ppm ","---- "]
["Sulfuryl fluoride ","2699-79-8 ","5 ppm ","10 ppm ","---- ","---- "]
["Sulprofos ","35400-43-2 ","1 mg/m3 ","3 mg/m3 ","---- ","---- "]
["Systox (Demeton) ","8065-48-3 ","0.01 ppm ","0.03 ppm ","---- ","X "]
["2, 4, 5-T (2, 4, 5- tri-","93-76-5 ","10 mg/m3 ","20 mg/m3 ","---- ","---- "]
["     chlorophenoxyacetic acid) "]
["Talc (containing asbestos)","---- ","0.1 f/cc ","1.0 f/cc (30 minutes) ","---- ","---- "]
["     (as asbestos)"]
["     (see WAC 296-62-07705"]
["     and chapter 296-65 WAC) "]
["Talc (containing no asbestos) ","---- ","---- ","---- ","---- ","---- "]
["     Respirable fraction ","14807-96-6 ","2 mg/m3 ","4 mg/m3 ","---- ","---- "]
["Tantalum ","---- ","---- ","---- ","---- ","---- "]
["     Metal and oxide dusts ","7440-25-7 ","5 mg/m3 ","10 mg/m3 ","---- ","---- "]
["TDI","584-84-9 ","0.005 ppm ","0.02 ppm ","---- ","---- "]
["     (Toluene-2, 4-diisocyanate) "]
["TEDP (Sulfotep) ","3689-24-5 ","0.2 mg/m3 ","0.6 mg/m3 ","---- ","X  "]
["Tellurium and compounds (as Te) ","13494-80-9 ","0.1 mg/m3 ","0.3 mg/m3 ","---- ","---- "]
["Tellurium hexafluoride (as Te) ","7783-80-4 ","0.02 ppm ","0.06 ppm ","---- ","---- "]
["Temephos (Abate) ","3383-96-8 ","---- ","---- ","---- ","---- "]
["     Total particulate ","---- ","10 mg/m3 ","20 mg/m3 ","---- ","---- "]
["     Respirable fraction ","---- ","5 mg/m3 ","10 mg/m3 ","---- ","---- "]
["TEPP ","107-49-3 ","0.004 ppm ","0.012 ppm ","---- ","X  "]
["Terphenyls ","26140-60-3 ","---- ","---- ","0.5 ppm ","---- "]
["1, 1, 1, 2-Tetrachloro-2,","76-11-0 ","500 ppm ","625 ppm ","---- ","---- "]
["     2-difluoroethane "]
["1, 1, 2, 2-Tetrachloro-1,","76-12-0 ","500 ppm ","625 ppm ","---- ","---- "]
["     2-difluoroethane "]
["1, 1, 2, 2-Tetrachloroethane ","79-34-5 ","1 ppm ","3 ppm ","---- ","X  "]
["Tetrachloroethylene","127-18-4 ","25 ppm ","38 ppm ","---- ","---- "]
["     (Perchloroethylene) "]
["Tetrachloromethane","56-23-5 ","2 ppm ","4 ppm ","---- ","X "]
["     (Carbon tetrachloride) "]
["Tetrachloronaphthalene ","1335-88-2 ","2 mg/m3 ","4 mg/m3 ","---- ","X  "]
["Tetraethyl lead (as Pb) ","78-00-2 ","0.075 mg/m3 ","0.225 mg/m3 ","---- ","X  "]
["Tetrahydrofuran ","109-99-9 ","200 ppm ","250 ppm ","---- ","---- "]
["Tetramethyl lead (as Pb) ","75-74-1 ","0.075 mg/m3 ","0.225 mg/m3 ","---- ","X  "]
["Tetramethyl succinonitrile ","3333-52-6 ","0.5 ppm ","1.5 ppm ","---- ","X  "]
["Tetranitromethane ","509-14-8 ","1 ppm ","3 ppm ","---- ","---- "]
["Tetrasodium pyrophosphate ","7722-88-5 ","5 mg/m3 ","10 mg/m3 ","---- ","---- "]
["Tetryl (2, 4, 6-trinitrophenyl-","479-45-8 ","1.5 mg/m3 ","3 mg/m3 ","---- ","X  "]
["     methylnitramine) "]
["Thallium (soluble compounds)","7440-28-0 ","0.1 mg/m3 ","0.3 mg/m3 ","---- ","X  "]
["     (as Tl) "]
["4, 4-Thiobis","96-69-5 ","---- ","---- ","---- ","---- "]
["     (6-tert-butyl-m-cresol) "]
["     Total particulate ","---- ","10 mg/m3 ","20 mg/m3 ","---- ","---- "]
["     Respirable fraction ","---- ","5 mg/m3 ","10 mg/m3 ","---- ","---- "]
["Thiodan","115-29-7 ","0.1 mg/m3 ","0.3 mg/m3 ","---- ","X "]
["     (Endosulfan) "]
["Thioglycolic acid ","68-11-1 ","1 ppm ","3 ppm ","----- ","X "]
["Thionyl chloride ","7719-09-7 ","---- ","---- ","1 ppm ","---- "]
["Thiram","137-26-8 ","5 mg/m3 ","10 mg/m3 ","---- ","---- "]
["     (see WAC 296-62-07519) "]
["Tin (as Sn) ","---- ","---- ","---- ","---- ","---- "]
["     Inorganic compounds ","7440-31-5 ","2 mg/m3 ","4 mg/m3 ","---- ","---- "]
["Tin (as Sn) ","---- ","---- ","---- ","---- ","---- "]
["     Organic compounds ","7440-31-5 ","0.1 mg/m3 ","0.3 mg/m3 ","---- ","X  "]
["Tin oxide (as Sn) ","21651-19-4 ","2 mg/m3 ","4 mg/m3 ","---- ","---- "]
["Titanium dioxide ","13463-67-7 ","---- ","---- ","---- ","---- "]
["     Total particulate ","---- ","10 mg/m3 ","20 mg/m3 ","---- ","---- "]
["TNT","118-96-7 ","0.5 mg/m3 ","1.5 mg/m3 ","---- ","X "]
["     (2, 4, 6-Trinitrotoluene) "]
["Toluene ","108-88-3 ","100 ppm ","150 ppm ","---- ","---- "]
["Toluene-2, 4-diisocyanate (TDI) ","584-84-9 ","0.005 ppm ","0.02 ppm ","----- ","---- "]
["m-Toluidine ","108-44-1 ","2 ppm ","4 ppm ","---- ","X "]
["o-Toluidine ","95-53-4 ","2 ppm ","4 ppm ","---- ","X "]
["p-Toluidine ","106-49-0 ","2.0 ppm ","4 ppm ","---- ","X "]
["Toxaphene","8001-35-2 ","0.5 mg/m3 ","1 mg/m3 ","---- ","X "]
["     (Chlorinated camphene) "]
["Tremolite (asbestiform)","---- ","0.1 f/cc ","1.0 f/cc (30 minutes) ","---- ","---- "]
["     (as asbestos)"]
["     (see WAC"]
["     296-62-07705 and"]
["     chapter 296-65 WAC) "]
["Tributyl phosphate ","126-73-8 ","0.2 ppm ","0.6 ppm ","---- ","---- "]
["Trichloroacetic acid ","76-03-9 ","1 ppm ","3 ppm ","---- ","---- "]
["1, 2, 4-Trichlorobenzene ","120-82-1 ","---- ","---- ","5 ppm ","---- "]
["1, 1, 1-Trichloroethane","71-55-6 ","350 ppm ","450 ppm ","---- ","---- "]
["     (Methyl chloroform) "]
["1, 1, 2-Trichloroethane ","79-00-5 ","10 ppm ","20 ppm ","---- ","---- "]
["Trichloroethylene ","79-01-6 ","50 ppm ","200 ppm ","---- ","---- "]
["Trichlorofluoromethane","75-69-4 ","---- ","---- ","1,000 ppm ","---- "]
["     (Fluorotrichloromethane) "]
["Trichloromethane","67-66-3 ","2 ppm ","4 ppm ","---- ","---- "]
["     (Chloroform) "]
["Trichloronaphthalene ","1321-65-9 ","5 mg/m3 ","10 mg/m3 ","---- ","X  "]
["1, 2, 3-Trichloropropane ","96-18-4 ","10 ppm ","20 ppm ","---- ","X  "]
["1, 1, 2-Trichloro-1, 2,","76-13-1 ","1,000 ppm ","1,250 ppm ","---- ","---- "]
["     2-trifluoroethane "]
["Tricyclohexyltin hydroxide","13121-70-5 ","5 mg/m3 ","10 mg/m3 ","---- ","---- "]
["     (Cyhexatin) "]
["Triethylamine ","121-44-8 ","10 ppm ","15 ppm ","---- ","---- "]
["Trifluorobromomethane ","75-63-8 ","1,000 ppm ","1,250 ppm ","---- ","---- "]
["Trimellitic anhydride ","552-30-7 ","0.005 ppm ","0.015 ppm ","---- ","---- "]
["Trimethylamine ","75-50-3 ","10 ppm ","15 ppm ","---- ","---- "]
["Trimethyl benzene ","25551-13-7 ","25 ppm ","38 ppm ","---- ","---- "]
["Trimethyl phosphite ","121-45-9 ","2 ppm ","4 ppm ","---- ","---- "]
["2, 4, 6-Trinitrophenol","88-89-1 ","0.1 mg/m3 ","0.3 mg/m3 ","---- ","X "]
["     (Picric acid) "]
["2, 4, 6-Trinitrophenyl-","479-45-8 ","1.5 mg/m3 ","3 mg/m3 ","----- ","X "]
["     methylnitramine"]
["     (Tetryl) "]
["2, 4, 6-Trinitrotoluene (TNT) ","118-96-7 ","0.5 mg/m3 ","1.5 mg/m3 ","---- ","X  "]
["Triorthocresyl phosphate ","78-30-8 ","0.1 mg/m3 ","0.3 mg/m3 ","---- ","X  "]
["Triphenyl amine ","603-34-9 ","5 mg/m3 ","10 mg/m3 ","---- ","---- "]
["Triphenyl phosphate ","115-86-6 ","3 mg/m3 ","6 mg/m3 ","---- ","---- "]
["Tungsten (as W) ","7440-33-7 ","---- ","---- ","---- ","---- "]
["     Soluble compounds ","---- ","1 mg/m3 ","3 mg/m3 ","---- ","---- "]
["     Insoluble compounds ","---- ","5 mg/m3 ","10 mg/m3 ","---- ","---- "]
["Turpentine ","8006-64-2 ","100 ppm ","150 ppm ","---- ","---- "]
["Uranium (as U) ","7440-61-1 ","---- ","---- ","---- ","---- "]
["     Soluble compounds ","---- ","0.05 mg/m3 ","0.15 mg/m3 ","---- ","---- "]
["     Insoluble compounds ","---- ","0.2 mg/m3 ","0.6 mg/m3 ","---- ","---- "]
["n-Valeraldehyde ","110-62-3 ","50 ppm ","75 ppm ","---- ","---- "]
["Vanadium (as V2O5) ","---- ","---- ","---- ","---- ","---- "]
["     Respirable fraction ","1314-62-1 ","0.05 mg/m3 ","0.15 mg/m3 ","---- ","---- "]
["Vegetable oil mist ","---- ","---- ","---- ","---- ","---- "]
["     Total particulate ","---- ","10 mg/m3 ","20 mg/m3 ","---- ","---- "]
["     Respirable fraction ","---- ","5 mg/m3 ","10 mg/m3 ","---- ","---- "]
["Vinyl acetate ","108-05-1 ","10 ppm ","20 ppm ","---- ","---- "]
["Vinyl benzene (Styrene) ","100-42-5 ","50 ppm ","100 ppm ","---- ","---- "]
["Vinyl bromide ","593-60-2 ","5 ppm ","10 ppm ","---- ","---- "]
["Vinyl chloride (Chloroethylene)","75-01-4 ","1 ppm ","5 ppm ","---- ","---- "]
["     (see WAC 296-62-07329) "]
["Vinyl cyanide (Acrylonitrile)","107-13-1 ","2 ppm ","10 ppm ","---- ","---- "]
["     (see WAC 296-62-07336) "]
["Vinyl cyclohexene dioxide ","106-87-6 ","10 ppm ","20 ppm ","---- ","X  "]
["Vinyl toluene ","25013-15-4 ","50 ppm ","75 ppm ","---- ","---- "]
["Vinylidene chloride","75-35-4 ","1 ppm ","3 ppm ","---- ","---- "]
["     (1, 1-Dichloroethylene) "]
["VM & P Naphtha ","8032-32-4 ","300 ppm ","400 ppm ","---- ","---- "]
["Warfarin ","81-81-2 ","0.1 mg/m3 ","0.3 mg/m3 ","---- ","---- "]
["Welding fumes","---- ","5 mg/m3 ","10 mg/m3 ","---- ","---- "]
["     (total particulate) "]
["Wood dust ","---- ","---- ","---- ","---- ","---- "]
["     Nonallergenic;","---- ","5 mg/m3 ","10 mg/m3 ","---- ","---- "]
["          (All woods except"]
["          allergenics) "]
["     Allergenics (e.g. cedar,","---- ","2.5 mg/m3 ","5 mg/m3 ","---- ","---- "]
["          mahogany and teak) "]
["Xylenes (ortho, meta, and","1330-20-7 ","100 ppm ","150 ppm ","---- ","---- "]
["     para isomers)"]
["     (Dimethylbenzene) "]
["m-Xylene alpha, alpha-diamine ","1477-55-0 ","---- ","---- ","0.1 mg/m3 ","X  "]
["Xylidine","1300-73-8 ","2 ppm ","4 ppm ","---- ","X  "]
["     (Dimethylaminobenzene) "]
["Yttrium ","7440-65-5 ","1 mg/m3 ","3 mg/m3 ","---- ","---- "]
["Zinc chloride fume ","7646-85-7 ","1 mg/m3 ","2 mg/m3 ","---- ","---- "]
["Zinc chromate (as Cr)","Varies with compound ","0.005 mg/m3 ","---- ","0.1 mg/m3 ","---- "]
["     (see WAC 296-62-08003) "]
["Zinc oxide ","1314-13-2 ","---- ","---- ","---- ","---- "]
["     Total particulate ","---- ","10 mg/m3 ","20 mg/m3 ","---- ","---- "]
["     Respirable fraction ","---- ","5 mg/m3 ","10 mg/m ","---- ","---- "]
["Zinc oxide fume ","1314-13-2 ","5 mg/g3 ","10 mg/m3 ","---- ","---- "]
["Zinc stearate ","557-05-1 ","---- ","---- ","---- ","---- "]
["     Total particulate ","---- ","10 mg/m3 ","20 mg/m3 ","---- ","---- "]
["     Respirable fraction ","---- ","5 mg/m3 ","10 mg/m3 ","---- ","---- "]
["Zirconium compounds (as Zr) ","7440-67-2 ","5 mg/m3 ","10 mg/m3 ","---- ","---- "]
[]
["[Statutory Authority: RCW 49.17.010, 49.17.040, 49.17.050, 49.17.060. 07-05-062, § 296-841-20025, filed 2/20/07, effective 4/1/07; 04-18-079, § 296-841-20025, filed 8/31/04, effective 11/1/04.]"]

{"sheet":"RREL Henry's Law Constants","index":9,"n_rows":109,"n_cols":19,"rows_kept":109,"cut":false,"hidden":false,"merged":[]}
["Extracted from EPA's RREL Treatability Database, 1994",null,"(atm*M3 / mol)"]
["COMPOUND","CASNO","HENRYS_LAW","MOL_WT","TYPE","STYPE","FORMULA","MELT_POINT","BOIL_POINT","VAPOR_PRES","SOLUBILITY","REF_HL","PART_COEFF","REF_PC","E_NONCAR","E_RISK","E_DWATER","E_WQUALITY","E_AQ_TOX"]
["ACENAPHTHENE","83-32-9","2.41 E-4 @ 25","154.21","PAH","","C12 H10","96.2","279","10 @ 131","3.42 @ 25","191D","3.92","1032A","NA","NA","NA","345B","NA"]
["DIMETHYLPHENOL,2,4-","105-67-9","1.7 E-5 @ 25","122.17","PHENOLIC","","C8 H10 O","27","210","98 @ 104","","2034B","2.42","1226A","NA","NA","NA","345B","5B"]
["DINITRO-o-CRESOL,4,6-","534-52-1","1.4 E-6 @ 25","198.13","PHENOLIC","","C7 H6 N2 O5","87.5","312","1 E-4 @ 25","130 @ 20","191D","2.85 (C)","379B","NA","NA","NA","NA","5B"]
["DINITROPHENOL,2,4-","51-28-5","6.45 E-10 @ 18 (C)","184.11","PHENOLIC","","C6 H4 N2 O5","115 TO 116","","","5600 @ 18","2034B","1.54","163A","4B","NA","NA","4B","5B"]
["DIPHENYLHYDRAZINE,1,2-","122-66-7","3.4 E-9 @ 25 (C)","184.24","AROMATIC","HYDRAZINE","C12 H12 N2","131","","","221","2034B","3.03","379B","NA","4B","NA","345B","5B"]
["ENDRIN","72-20-8","4 E-7 @ 25 (C)","380.93","PESTICIDE","","C12 H8 CL6 O","245 DECOMPOSES","","2 E-7 @ 25","0.26 @ 25","2034B","5.6 (C)","463A","NA","NA","357B","345B","5B"]
["ETHYLBENZENE","100-41-4","6.44 E-3 @ 25","106.17","AROMATIC","HYDROCARBON","C8 H10","-95","136.2","10 @ 25.9","152 @ 20","191D","3.15","379B","4B","NA","346B","4B","5B"]
["FLUORANTHENE","206-44-0","6.5 E-6 @ 25 (C)","202.26","PAH","","C16 H10","107","375","","0.265 @ 25","2034B","5.33 (C)","379B","NA","NA","NA","345B","5B"]
["FLUORENE","86-73-7","1.17 E-4 @ 25","166.22","PAH","","C13 H10","114.8","295","10 @ 146","1.9 @ 25","191D","4.18","1032A","NA","NA","NA","NA","5B"]
["FURFUROL","98-01-1","3.6 E-6","96.08","FURAN","ALDEHYDE","C5 H4 O2","-36.5","161.8","1 @ 18.5","8.3 E 4 @ 20","2029A","0.52","1193B","NA","NA","NA","NA","5B"]
["HEPTACHLOR","76-44-8","1.48 E-3","373.32","PESTICIDE","","C10 H5 CL7","95","","3 E-4 @ 25","0.056 @ 25","191B","","NA","NA","NA","357B","345B","5B"]
["HEPTACHLOR EPOXIDE","1024-57-3","3.16 E-5 @ 25","389.2","PESTICIDE","","C10 H5 CL7 O","157","","","0.35 @ 25","191B","","NA","4B","NA","357B","4B","5B"]
["HEXACHLOROBENZENE","118-74-1","1.70 E-3 @ 25","284.78","AROMATIC","HALOGENATED","C6 CL6","231","323","1 @ 114.4","0.11 @ 24","191D","5.47","1032A","NA","NA","346B","345B","NA"]
["HEXACHLOROBUTADIENE","87-68-3","0.0256 @ 20 (C)","260.76","HYDROCARBON","HALOGENATED","C4 CL6","-21","215","0.15 @ 20","2 @ 20","2034B","4.78","1226A","4B","4B","NA","4B","5B"]
["HEXACHLOROCYCLOPENTADIENE","77-47-4","0.016 @ 25 (C)","272.77","CYCLIC","HALOGENATED","C5 CL6","-10","239","0.08 @ 25","1.8 @ 25","2034B","3.99","379B","4B","NA","NA","4B","5B"]
["HEXACHLOROETHANE","67-72-1","9.85 E-3 @ 25","236.74","HYDROCARBON","HALOGENATED","C2 CL6","186.8 TRIPLE POINT","186.8","0.40 @ 20","50 @ 22","191B","4.14","1237A","NA","4B","NA","4B","5B"]
["INDENO(1,2,3-cd)PYRENE","193-39-5","6.95 E-8 @ 25 (C)","276.34","PAH","","C22 H12","160","536","","","2034B","7.66 (C)","379B","NA","NA","NA","345B","NA"]
["MERCURY","7439-97-6","1.14 E-2 (C)","200.59","INORGANIC","ELEMENT","HG","-38.87","356.58","1.2 E-3 @ 20","0.056 @ 25","1018A","","NA","NA","NA","349B","345B","5B"]
["METHYL CHLORIDE","74-87-3","8.82 E-3 @ 24.8","50.49","HYDROCARBON","HALOGENATED","C H3 CL","-97.7","-24.22","3800 @ 20","6360 @ 20","1034A","0.91","379A","NA","NA","NA","345B","5B"]
["METHYLENE CHLORIDE","75-09-2","3.19 E-3 @ 25","84.93","HYDROCARBON","HALOGENATED","C H2 CL2","-95.1","40","429 @ 25","1.67 E 4 @ 25","191D","1.25","338D","4B","4B","346B","4B","5B"]
["N-NITROSODIPHENYLAMINE","86-30-6","3.13","198.23","AROMATIC","AMINE","C12 H10 N2 O","66.5","","0.1","35","1226A","2.79","1226A","NA","4B","NA","4B","5B"]
["NAPHTHALENE","91-20-3","4.83 E-4 @ 25","128.17","PAH","","C10 H8","80.5","218","0.082 @ 25","30 @ 25","419A","3.37","163A","NA","NA","NA","345B","5B"]
["NITROBENZENE","98-95-3","2.38 E-5 @ 25","123.11","AROMATIC","NITRO","C6 H5 N O2","5.7","210.8","0.15 @ 20","1900 @ 20","191D","1.85","163A","4B","NA","NA","4B","5B"]
["OCTANE","111-65-9","3.21 @ 25","114.23","HYDROCARBON","","C8 H18","-56.8","125.7","11 @ 20","20","1018A","5.18","1193B","NA","NA","NA","NA","5B"]
["PCB 1016","12674-11-2","1.35 E-2","257.9","PCB","","C12 H7 CL3 (57%)","","325 TO 356","4 E-4 @ 25 (EST)","0.049 @ 24","1115D","4.38","378B","NA","NA","NA","345B","5B"]
["PCB 1221","11104-28-2","2.28 E-4 @ 25 (C)","200.7","PCB","","C12 H9 CL (51%)","","275 TO 320","6.7 E-3 @ 25 (EST)","0.59 @ 24","1221A","4.09","378B","NA","NA","NA","345B","5B"]
["PCB 1242","53469-21-9","3.43 E-4 @ 25","266.5","PCB","","C12 H7 CL3 (49%)","","325 TO 366","4.06 E-4 @ 25","0.10 @ 24","1221A","4.11","378B","NA","NA","NA","345B","5B"]
["PCB 1248","12672-29-6","4.4 E-4 @ 25","299.5","PCB","","C12 H6 CL4 (40%)","","340 TO 375","4.94 E-4 @ 25","0.054","1221A","5.75","378B","NA","NA","NA","345B","5B"]
["PCB 1254","11097-69-1","8.37 E-3 @ 25","328.4","PCB","","C12 H5 CL5 (48%)","","365 TO 390","7.71 E-5 @ 25","0.057 @ 24","191B","6.03 (EST)","378B","NA","NA","NA","345B","5B"]
["PCB 1260","11096-82-5","3.36 E-4 @ 25","375.7","PCB","","C12 H3 CL7 (41%)","","385 TO 420","4.05 E-5 @ 25","0.080 @ 24","1221A",">6.11","378B","NA","NA","NA","345B","5B"]
["PENTACHLOROPHENOL","87-86-5","2.8 E-6 @ 20 (C)","266.34","PESTICIDE","","C6 H CL5 O","191","309","1.1 E-4 @ 20","14 @ 20","2034B","5.01","163A","4B","NA","357B","4B","5B"]
["PHENANTHRENE","85-01-8","3.93 E-5 @ 25","178.23","PAH","","C14 H10","100","340","1 @ 118.2","0.816 @ 21","419A","4.46","163A","NA","NA","NA","345B","5B"]
["PHENOL","108-95-2","1.3 E-6 @ 25","94.11","PHENOLIC","","C6 H6 O","43","181.7","0.35 @ 25","8 E 4 @ 25","191B","1.46","163A","4B","NA","NA","4B","5B"]
["PYRENE","129-00-0","5.1 E-6 @ 25 (C)","202.26","PAH","","C16 H10","156","393","2.5 @ 200","0.16 @ 26","2034B","5.18","1032A","NA","NA","NA","NA","5B"]
["TETRACHLORODIBENZO-p-DIOXIN,2,3,7,8-","1746-01-6","2.1 E-3 (C)","321.96","DIOXIN","","C12 H4 CL4 O2","303 TO 305","","7.4 E-10 @ 25","1.93 E-5","2034B","6.64","1220A","NA","NA","NA","345B","5B"]
["TETRACHLOROETHANE,1,1,1,2-","630-20-6","0.011 (C)","167.85","HYDROCARBON","HALOGENATED","C2 H2 CL4","-70.2","130.5","10 @ 19.3","200 @ 20","2033B","3.04 (C)","2033B","NA","NA","NA","345B","5B"]
["TETRACHLOROETHANE,1,1,2,2-","79-34-5","3.8 E-4 @ 20 (C)","167.85","HYDROCARBON","HALOGENATED","C2 H2 CL4","-43.8","146.3","4 @ 25","2900 @ 20","2034B","2.39","1226A","NA","4B","NA","345B","5B"]
["TETRACHLOROETHYLENE","127-18-4","2.87 E-2 @ 25","165.83","HYDROCARBON","HALOGENATED","C2 CL4","-22.4","121.1","19  @ 25","150 @ 25","191D","2.53","1226A","4B","NA","346B","345B","5B"]
["TETRAHYDROFURAN","109-99-9","1.1 E-4","72.11","FURAN","","C4 H8 O","-108.5","66","162 @ 25","MISCIBLE","2029A","0.46","1234A","NA","NA","NA","NA","NA"]
["TOLUENE","108-88-3","5.92 E-3 @ 25","92.14","AROMATIC","HYDROCARBON","C7 H8","-95","110.6","28 @ 25","515 @ 20","191B","2.69","163A","4B","NA","346B","4B","5B"]
["TOXAPHENE","8001-35-2","4.89 E-3 @ 25","414 (AVG)","PESTICIDE","","C10 H10 CL8 (AVG)","70-95",">120 DECOMPOSES","0.2 TO 0.4 @ 25","0.5-3 @ 25","191D","3.3","378B","NA","NA","357B","345B","5B"]
["TRICHLOROBENZENE,1,2,4-","120-82-1","1.42 E-3 @ 25","181.46","AROMATIC","HALOGENATED","C6 H3 CL3","17","213.5","1 @ 38.4","19 @ 22","191D","3.98","1032A","4B","NA","NA","4B","5B"]
["TRICHLOROETHANE,1,1,1-","71-55-6","4.08 E-3 @ 25","133.40","HYDROCARBON","HALOGENATED","C2 H3 CL3","-30.4","74.1","100 @ 20","4400 @ 20","191D","2.47","1226A","4B","NA","346B","4B","5B"]
["TRICHLOROETHYLENE","79-01-6","1.17 E-2 @ 25","131.39","HYDROCARBON","HALOGENATED","C2 H CL3","-84.8","86.7","77 @ 25","1100 @ 25","191D","2.53","1032A","NA","4B","346B","4B","5B"]
["TRICHLOROMONOFLUOROMETHANE","75-69-4","5.83 E-2 @ 25","137.4","HYDROCARBON","HALOGENATED","C CL3 F","-111","23.8","687 @ 20","1100 @ 25","191D","2.53","338D","4B","NA","NA","345B","NA"]
["TRICHLOROPHENOL,2,4,6-","88-06-2","4 E-6 @ 25 (C)","197.45","PHENOLIC","HALOGENATED","C6 H3 CL3 O","69.5","246","1 @ 76.5","800 @ 25","2034B","3.69","163A","NA","4B","NA","4B","5B"]
["TRINITROTOLUENE,2,4,6-","118-96-7","2.0 E-7","227.13","AROMATIC","NITRO","C7 H5 N3 O6","80.1","240 EXPLODES","0.046 @ 82","100 @ 25","2033B","5.53 (C)","2033B","NA","NA","NA","NA","5B"]
["VINYL CHLORIDE","75-01-4","2.78 E-2 @ 25","62.50","HYDROCARBON","HALOGENATED","C2 H3 CL","-159.7","-13.9","2580 @ 20","1.1 @ 25","1034A","0.60","379B","NA","NA","346B","345B","5B"]
["XYLENE,o-","95-47-6","5.27 E-3 @ 25 (C)","106.16","HYDROCARBON","AROMATIC","C8 H10","-25.2","144.4","5 @ 20","175 @ 20","1018A","2.77","463A","NA","NA","346B","NA","5B"]
["PICRIC ACID","88-89-1","2.03","229.11","HYDROCARBON","AROMATIC","C6 H3 N3 O7","121.8",">300 EXPLOSIVE","","1.4 E 4 @ 20","463A","","NA","NA","NA","NA","NA","5B"]
["OXALIC ACID","144-62-7","-0.81 TO -0.43","90.04","ORGANIC ACID","","C2 H2 O4","189.5 DECOMPOSES","SUBLIMES","3 E-4 @ 30","9.5 E 4","463A","","NA","NA","NA","NA","NA","5B"]
["N-METHYLANILINE","100-61-8","1.66","107.16","HYDROCARBON","AROMATIC","C7 H9 N","-57","196","1 @ 36","SLIGHTLY SOLUBLE","163A","","NA","NA","NA","NA","NA","5B"]
["HEXANOIC ACID","142-62-1","1.88","116.16","ORGANIC ACID","","C6 H12 O2","-4","205.7","0.2 @ 20","1.1 E 4","463A","","NA","NA","NA","NA","NA","5B"]
["TERPINEOL,alpha-","98-55-5","6.09 E-5","154.25","ALCOHOL","CYCLIC","C10 H18 O","36.9","217 to 218","1 @ 53","","NA","","NA","NA","NA","NA","NA","5B"]
["BENZYL ALCOHOL","100-51-6","1.10","108.13","ALCOHOL","AROMATIC","C7 H8 O","-15.3","205.3","0.15 @ 25","3.5 E 4 @ 20","163A","","NA","NA","NA","NA","NA","5B"]
["ACENAPHTHYLENE","208-96-8","1.14 E-4 @ 25","152.20","PAH","","C12 H8","92","265","","3.93 @ 25","191D","4.07 (C)","379B","NA","NA","NA","345B","5B"]
["ACRYLONITRILE","107-13-1","8.8 E-5 (C)","53.06","NITRILE","UNSATURATED","C3 H3 N","-83.7","77.4","137 @ 30","7.35 E 4 @ 20","2034B","-0.92","463A","NA","4B","NA","345B","5B"]
["ALDRIN","309-00-2","4.96 E-4 @ 25","364.91","PESTICIDE","","C12 H8 CL6","104","","2.3 E-5 @ 20","0.017 @ 25","191D","5.11","2032B","4B","4B","NA","345B","5B"]
["AMINOPHENOL,3-","591-27-5","0.15/0.17","109.13","PHENOLIC","AMINE","C6 H7 N O","122 TO 123","164 @ 11 mm HG","","2.6 E 4","163A","0.17","163A","NA","NA","NA","NA","NA"]
["ANTHRACENE","120-12-7","8.6 E-5 @ 25 (C)","178.23","PAH","","C14 H10","216.3","340","","1.29 @ 25","2034B","4.45","379B","NA","NA","NA","345B","5B"]
["BENZENE","71-43-2","5.55 E-3 @ 25","78.11","AROMATIC","HYDROCARBON","C6 H6","5.5","80.1","95 @ 25","1780 @ 20","191D","2.13","379B","NA","4B","346B","345B","5B"]
["BENZO(a)PYRENE","50-32-8","4.9 E-7 @ 25 (C)","252.30","PAH","","C20 H12","179 TO 179.3","","5 E-9 @ 20","0.0038 @ 25","2034B","5.98","1032A","NA","4B","NA","345B","5B"]
["BENZOTRICHLORIDE","98-07-7","3.1 E-4 (C)","195.48","AROMATIC","HALOGENATED","C7 H5 CL3","-5.0","220.8","40 @ 119.8","INSOLUBLE","2033B","2.92","163A","NA","NA","NA","NA","5B"]
["BENZYL CHLORIDE","100-44-7","5.1 E-3 (C)","126.59","AROMATIC","HALOGENATED","C7 H7 CL","-43","179","1 @ 22","INSOLUBLE","2033B","2.30","163A","NA","NA","NA","345B","5B"]
["BHC,gamma-","58-89-9","4.93 E-7 @ 25 (C)","290.83","PESTICIDE","","C6 H6 CL6","112.5","323.4","9.4 E-6 @ 20","7 @ 20","1018A","3.24 (C)","163A","4B","NA","NA","4B","5B"]
["BIPHENYL","92-52-4","4.08 E-4 @ 25","154.20","AROMATIC","HYDROCARBON","C12 H10","68.8","255","1 @ 70.6","7.5 @ 25","419A","3.95","1032A","4B","NA","NA","NA","5B"]
["BIS(2-CHLOROETHYL)ETHER","111-44-4","1.3 E-5 @ 20 (C)","143.01","ETHER","HALOGENATED","C4 H8 CL2 O","-51.7","178.8","0.71 @ 20","1.02 E 4","2034B","1.58 (C)","379B","NA","4B","NA","345B","5B"]
["BIS(2-ETHYLHEXYL)PHTHALATE","117-81-7","3 E-7 @ 20 (C)","390.57","PHTHALATE","","C24 H38 O4","-50","384","1.2 @ 200","0.4 & 1.3 @ 25","2034B","5.3","379B","4B","NA","NA","4B","5B"]
["BIS(CHLOROMETHYL)ETHER","542-88-1","2.1 E-4 @ 25","114.96","ETHER","HALOGENATED","C2 H4 CL2 O","-41.5","104","30 @ 22","2.2 E 4 @ 25","2034B","-0.38 (C)","379B","NA","NA","NA","345B","NA"]
["BROMOFORM","75-25-2","5.32 E-4 @ 25","252.73","HYDROCARBON","HALOGENATED","C H BR3","8.3","149.5","5.6 @ 25","3200 @ 30","191D","2.30 (C)","379B","4B","NA","NA","NA","5B"]
["CARBON TETRACHLORIDE","56-23-5","2.93 E-2 @ 25","153.82","HYDROCARBON","HALOGENATED","C CL4","-23","76.8","113 @ 25","800 @ 20","191D","2.73","1226A","4B","4B","346B","4B","NA"]
["CHLORDANE","57-74-9","4.79 E-5 @ 25","409.80","PESTICIDE","","C10 H6 CL8","107 CIS; 103 TRANS","175","1E-5 @ 25","0.056","191D","2.78","378B","4B","NA","357B","4B","5B"]
["CHLORO-m-CRESOL,p-","59-50-7","2.5 E-6 @ 20 (C)","142.59","PHENOLIC","HALOGENATED","C7 H7 CL O","66","235","","3850 @ 20","2034B","3.10","163A","NA","NA","NA","NA","5B"]
["CHLOROACETALDEHYDE","107-20-0","1 E-3 @ 20","78.50","ALDEHYDE","HALOGENATED","C2 H3 CL O","","85","100 @ 25","","2033B","-3.8 (C)","2033B","NA","NA","NA","NA","5B"]
["CHLOROBENZENE","108-90-7","3.93 E-3 @ 25","112.56","AROMATIC","HALOGENATED","C6 H5 CL","-45.6","132","11.8 @ 25","488 @ 25","191D","2.84","163A","NA","NA","346B","345B","5B"]
["CHLORODIBROMOMETHANE","124-48-1","7.83 E-4 @ 25","208.28","HYDROCARBON","HALOGENATED","C H BR2 CL","-22","120","15 @ 10.5","","191D","2.09 (C)","379B","NA","NA","NA","345B","5B"]
["CHLOROETHANE","75-00-3","1.11 E-2 @ 24.8","64.51","HYDROCARBON","HALOGENATED","C2 H5 CL","-136.4","12.3","2660 @ 25","5740 @ 20","1034A","1.43","338D","NA","NA","NA","345B","NA"]
["CHLOROFORM","67-66-3","3.39 E-3 @ 25","119.38","HYDROCARBON","HALOGENATED","C H CL3","-63.5","61.7","160 @ 20","9300 @ 25","191D","1.97","163A","4B","NA","NA","345B","5B"]
["CHLOROPHENOL,2-","95-57-8","1.03 E-5 @ 20 (C)","128.56","PHENOLIC","HALOGENATED","C6 H5 CL O","9.0","174.9","40 @ 82","2.85 E 4 @ 20","2034B","2.15","163A","NA","NA","NA","345B","5B"]
["CHRYSENE","218-01-9","1.05 E-6 @ 25 (C)","228.29","PAH","","C18 H12","254","448","6.3 E-9 @ 25","0.006 @ 25","2034B","5.61","379B","NA","NA","NA","345B","5B"]
["CUMENE","98-82-8","1.46 E-2 @ 25 (C)","120.19","AROMATIC","HYDROCARBON","C9 H12","-96","152.4","3.2 @ 20","50 @ 20","1018A","3.66","463A","NA","NA","NA","NA","5B"]
["DDT,p,p'-","50-29-3","3.89 E-5 @ 25 (C)","354.49","PESTICIDE","","C14 H9 CL5","108","260","1.5 E-7 @ 20","0.0031 @ 25","1018A","6.19","463A","4B","NA","NA","4B","5B"]
["DI-n-BUTYL PHTHALATE","84-74-2","2.8 E-7 @ 25 (C)","278.35","PHTHALATE","","C16 H22 O4","-35","340","0.1 @ 115","400 @ 25","2034B","5.2 (C)","379B","4B","NA","NA","4B","5B"]
["DIBENZO(a,h)ANTHRACENE","53-70-3","7.3 E-8 @ 25 (C)","278.35","PAH","","C22 H14","266","524","","0.0005 @ 25","2034B","5.97 (C)","379B","NA","NA","NA","345B","NA"]
["DICHLOROBENZENE,1,2-","95-50-1","1.94 E-3 @ 25","147.00","AROMATIC","HALOGENATED","C6 H4 CL2","-17.0","180.5","1.5 @ 25","145 @ 25","191D","3.38","163A","NA","NA","346B","345B","5B"]
["DICHLOROBENZENE,1,3-","541-73-1","2.63 E-3 @ 25","147.00","AROMATIC","HALOGENATED","C6 H4 CL2","-24.7","173","1.0 @ 12.1","123 @ 25","191D","3.38","163A","NA","NA","346B","345B","5B"]
["DICHLOROBENZENE,1,4-","106-46-7","2.72 E-3 @ 25","147.00","AROMATIC","HALOGENATED","C6 H4 CL2","53.1","174","1.8 @ 30","79 @ 25","191D","3.39","163A","NA","NA","346B","345B","5B"]
["DICHLOROBROMOMETHANE","75-27-4","2.12 E-3 @ 25","163.83","HYDROCARBON","HALOGENATED","C H BR CL2","-55","89.2","50 @ 20","","191D","1.88 (C)","379B","4B","NA","NA","4B","5B"]
["DICHLOROETHANE,1,1-","75-34-3","5.45 E-3 @ 25","98.96","HYDROCARBON","HALOGENATED","C2 H4 CL2","-97.0","57.3","234 @ 25","5500 @ 20","191D","1.79","338D","NA","NA","NA","345B","5B"]
["DICHLOROETHANE,1,2-","107-06-2","1.10 E-3 @ 25","98.96","HYDROCARBON","HALOGENATED","C2 H4 CL2","-35.3","83.5","79 @ 25","8690 @ 20","191D","1.45","1226A","NA","4B","346B","345B","5B"]
["DICHLOROETHYLENE,1,1-","75-35-4","1.49 E-2 @ 25","96.94","HYDROCARBON","HALOGENATED","C2 H2 CL2","-122.6","31.6","591 @ 25","210 @ 25","191D","1.48","379B","4B","4B","346B","4B","5B"]
["DICHLOROETHYLENE,1,2-CIS-","156-59-2","4.08 E-3 @ 24.8","96.94","HYDROCARBON","HALOGENATED","C2 H2 CL2","-81.5","60","202 @ 25","800 @ 20","1034A","","NA","NA","NA","346B","345B","NA"]
["DICHLOROETHYLENE,1,2-TRANS-","156-60-5","5.32 E-3 @ 25","96.94","HYDROCARBON","HALOGENATED","C2 H2 CL2","-50","47.5","331 @ 25","600 @ 20","191D","1.48 (C)","379B","NA","NA","346B","345B","5B"]
["DICHLOROPHENOL,2,4-","120-83-2","2.8 E-6 @ 20 (C)","163.0","PHENOLIC","HALOGENATED","C6 H4 CL2 O","45","210","1 @ 53","4500 @ 25","2034B","2.75","379B","4B","NA","NA","4B","5B"]
["DICHLOROPHENOL,2,6-","87-65-0","4 E-5 (C)","163.00","PHENOLIC","HALOGENATED","C6 H4 CL2 O","65 TO 68","218 TO 220","1 @ 59.5","","2033B","2.88","2033B","NA","NA","NA","345B","5B"]
["DICHLOROPROPANE,1,2-","78-87-5","2.82 E-3 @ 25","112.99","HYDROCARBON","HALOGENATED","C3 H6 CL2","-100.4","96.4","42 @ 20","2700 @ 20","191D","2.28 (C)","379B","NA","NA","357B","345B","5B"]
["DICHLOROPROPYLENE,1,3-","542-75-6","3.5 E-3 @ 25","110.97","HYDROCARBON","HALOGENATED","C3 H4 CL2","<-50","104.3 CIS; 112 TRANS","43 CIS; 34 TRANS @ 25","2700 @ 25 APPROX","191D","1.98 (C)","379B","NA","NA","NA","345B","5B"]
["DIELDRIN","60-57-1","5.84 E-5 @ 25","380.93","PESTICIDE","","C12 H8 CL6 O","176","","1.8 E-7 @ 25","0.186 @ 20","191D","4.09","2032B","NA","NA","NA","345B","5B"]
["PROPYLPHENOL,4-","645-56-7","0.86 (C)","136.19","PHENOLIC","","C9 H12 O","22","232.6","","VERY SLIGHTLY SOLUBLE","163A","","NA","NA","NA","NA","345B","NA"]
["HYDROXYBENZOIC ACID,4-","99-96-7","1.58","138.13","AROMATIC","ACID","C7 H6 O3","213 TO 214","","","8,000","163A","","NA","NA","NA","NA","NA","5B"]
["METHOXYPHENOL,4-","150-76-5","1.34","124.14","PHENOLIC","","C7 H8 O2","55 TO 57","243","","4 E 4 @ 25","163A","","NA","NA","NA","NA","NA","5B"]
["AMINOPHENOL,4-","123-30-8","0.04","109.13","PHENOLIC","AMINE","C6 H7 N O","190","284 DECOMPOSES","","6,500 @ 24","163A","","NA","NA","NA","NA","NA","5B"]
["PENTANEDIONE,2,4-","123-54-6","1.90 TO 2.25","100.11","KETONE","","C5 H8 O2","-23.1","140.6","","1.25 E 5 @ 20","163A","","NA","NA","NA","NA","NA","5B"]
["ETHYLPHENOL,2-","90-00-6","0.83/0.68","122.17","PHENOLIC","","C8 H10 O","-3.4","204.5","1 @ 46.2","INSOLUBLE","163A","","NA","NA","NA","NA","NA","NA"]
["METHOXYPHENOL,2-","90-05-1","1.31/2.53","124.14","PHENOLIC","","C7 H8 O2","28","205","0.103 @ 25","1.6 E 4 @ 15","463A","","NA","NA","NA","NA","NA","5B"]
["AMINOPHENOL,2-","95-55-6","0.52/0.62","109.13","PHENOLIC","AMINE","C6 H7 N O","170 TO 174","SUBLIMES","","2 E 4","163A","","NA","NA","NA","NA","NA","5B"]
["TRICHLOROBENZENE,1,3,5-","108-70-3","4.27","181.45","AROMATIC","HALOGENATED","C6 H3 CL3","63.4","208.5","","5.8 @ 20","1236A","","NA","NA","NA","NA","345B","NA"]